Errore KRPMBuilder

21 risposte [Ultimo messaggio]
Ritratto di Utino
Utino
(Monster)
Offline
Monster
Iscritto: 14/10/2006
Messaggi: 212

Ciao a tutti, sto cercadn oinvano di compilare i sorgenti di uno screensaver (kcometen3 1.1), quello che esce da KRPMBuilder è:

Building the spec file... done
Building package now...
Building target platforms: i386
Building for target i386
Executing(%prep): /bin/sh -e /var/tmp/rpm-tmp.71184
+ umask 022
+ cd /usr/src/packages/BUILD
+ rm -rf /var/tmp/build-root-kcometen3
+ mkdir /var/tmp/build-root-kcometen3
+ cd /usr/src/packages/BUILD
+ rm -rf kcometen3-1.1
+ /usr/bin/gzip -dc /usr/src/packages/SOURCES/kcometen3-1.1.tar.gz
+ tar -xf -
+ STATUS=0
Executing(%build): /bin/sh -e /var/tmp/rpm-tmp.71184
+ '[' 0 -ne 0 ']'
+ cd kcometen3-1.1
+ exit 0
+ umask 022
+ cd /usr/src/packages/BUILD
+ cd kcometen3-1.1
+ CFLAGS='-O2 -g -m32 -march=i486 -fmessage-length=0 -D_FORTIFY_SOURCE=2'
+ CXXFLAGS='-O2 -g -m32 -march=i486 -fmessage-length=0 -D_FORTIFY_SOURCE=2'
+ ./configure --prefix=/opt/kde3
checking build system type... x86_64-unknown-linux-gnu
checking host system type... x86_64-unknown-linux-gnu
checking target system type... x86_64-unknown-linux-gnu
checking for a BSD-compatible install... /usr/bin/install -c
checking for -p flag to install... yes
checking whether build environment is sane... yes
checking for gawk... gawk
checking whether make sets $(MAKE)... yes
checking for style of include used by make... GNU
checking for gcc... gcc
checking for C compiler default output file name... configure: error: C compiler cannot create executables
See `config.log' for more details.
error: Bad exit status from /var/tmp/rpm-tmp.71184 (%build)
Bad exit status from /var/tmp/rpm-tmp.71184 (%build)

RPM build errors:
___________________________

Ho seguito la guida che c'è sul sito e tutto sembra ok.. peccato che poi non vada.
Ho cercato su questo forum e in giro ma quest'errore pare non sia molto diffuso... che fortunello che sono!

qualcuno mi sa aiutare?

Grassie

Be free, use Linux! ma meglio se openSUSE...

Ritratto di anubis
anubis
(Guru)
Offline
Guru
Iscritto: 07/04/2007
Messaggi: 3656

il problema nn è il programma ma ti mancano i compilatori installali da
yast -->modelli-->sviluppo c\c++

OpenSUSE Member,Packman Packager, Education Project Admin, LXDE Project Admin
Powered by http://en.opensuse.org/HP_Pavilion_dv6855el

Ritratto di Utino
Utino
(Monster)
Offline
Monster
Iscritto: 14/10/2006
Messaggi: 212

Ho provato anche questa soluzione.
Non sapendo cosa installazre ho installato tutti i pacchetti presenti nella sezione che mi hai indicato... nulla da fare stesso identico errore.

Ricordo che ho seguito la guida che c'è su questo sito e "tutto" era giusto...

ho provato anche da riga di comando, qualcuno diceva che i programmi gui non vanno bene... stessa cosa.

altre idee per piacere?

Be free, use Linux! ma meglio se openSUSE...

Ritratto di anubis
anubis
(Guru)
Offline
Guru
Iscritto: 07/04/2007
Messaggi: 3656

prova a dare a manina ./configure .. vedi se ti da lo stesso errore.. e credo di si.. quindi posta il contenuto del file config.log

OpenSUSE Member,Packman Packager, Education Project Admin, LXDE Project Admin
Powered by http://en.opensuse.org/HP_Pavilion_dv6855el

Ritratto di Utino
Utino
(Monster)
Offline
Monster
Iscritto: 14/10/2006
Messaggi: 212

ok, ho fatto un passo avanti, mancavano le GCC a 32bit ! ho trovato un repo su download.opensuse.org con le GCC le ho installate ed ora quel problema si è risolto, Peccato che adesso ce ne sia un altro:

configure: error: We need a working libXext to proceed. Since configure
can't find it itself, we stop here assuming that make wouldn't find
them either.

il config.log di krpmbuild è:

This file contains any messages produced by compilers while
running configure, to aid debugging if configure makes a mistake.

It was created by configure, which was
generated by GNU Autoconf 2.59. Invocation command line was

$ ./configure --prefix=/opt/kde3

## --------- ##
## Platform. ##
## --------- ##

hostname = openSUSE103
uname -m = x86_64
uname -r = 2.6.22.9-0.4-default
uname -s = Linux
uname -v = #1 SMP 2007/10/05 21:32:04 UTC

/usr/bin/uname -p = unknown
/bin/uname -X = unknown

/bin/arch = x86_64
/usr/bin/arch -k = unknown
/usr/convex/getsysinfo = unknown
hostinfo = unknown
/bin/machine = unknown
/usr/bin/oslevel = unknown
/bin/universe = unknown

PATH: /sbin
PATH: /bin
PATH: /usr/sbin
PATH: /usr/bin
PATH: /opt/kde3/bin
PATH: /home/luca/bin
PATH: /usr/local/bin
PATH: /usr/bin
PATH: /bin
PATH: /usr/bin/X11
PATH: /usr/X11R6/bin
PATH: /usr/games
PATH: /usr/lib64/jvm/jre/bin
PATH: /usr/lib/mit/bin
PATH: /usr/lib/mit/sbin
PATH: /usr/lib/qt3/bin

## ----------- ##
## Core tests. ##
## ----------- ##

configure:1561: checking build system type
configure:1579: result: x86_64-unknown-linux-gnu
configure:1587: checking host system type
configure:1601: result: x86_64-unknown-linux-gnu
configure:1609: checking target system type
configure:1623: result: x86_64-unknown-linux-gnu
configure:1670: checking for a BSD-compatible install
configure:1725: result: /usr/bin/install -c
configure:1740: checking for -p flag to install
configure:1753: result: yes
configure:1764: checking whether build environment is sane
configure:1807: result: yes
configure:1827: checking for gawk
configure:1843: found /bin/gawk
configure:1853: result: gawk
configure:1863: checking whether make sets $(MAKE)
configure:1883: result: yes
configure:2096: checking for style of include used by make
configure:2124: result: GNU
configure:2271: checking for gcc
configure:2287: found /usr/bin/gcc
configure:2297: result: gcc
configure:2541: checking for C compiler version
configure:2544: gcc --version </dev/null >&5
gcc (GCC) 4.2.3 20071030 (prerelease) (SUSE Linux)
Copyright (C) 2007 Free Software Foundation, Inc.
This is free software; see the source for copying conditions. There is NO
warranty; not even for MERCHANTABILITY or FITNESS FOR A PARTICULAR PURPOSE.

configure:2547: $? = 0
configure:2549: gcc -v </dev/null >&5
Using built-in specs.
Target: x86_64-suse-linux
Configured with: ../configure --enable-threads=posix --prefix=/usr --with-local-prefix=/usr/local --infodir=/usr/share/info --mandir=/usr/share/man --libdir=/usr/lib64 --libexecdir=/usr/lib64 --enable-languages=c,c++,objc,fortran,obj-c++,java,ada --enable-checking=release --with-gxx-include-dir=/usr/include/c++/4.2.3 --enable-ssp --disable-libssp --disable-libgcj --with-slibdir=/lib64 --with-system-zlib --enable-shared --enable-__cxa_atexit --enable-libstdcxx-allocator=new --disable-libstdcxx-pch --program-suffix=-4.2 --enable-version-specific-runtime-libs --without-system-libunwind --with-cpu=generic --host=x86_64-suse-linux
Thread model: posix
gcc version 4.2.3 20071030 (prerelease) (SUSE Linux)
configure:2552: $? = 0
configure:2554: gcc -V </dev/null >&5
gcc: '-V' option must have argument
configure:2557: $? = 1
configure:2580: checking for C compiler default output file name
configure:2583: gcc -O2 -g -m32 -march=i486 -fmessage-length=0 -D_FORTIFY_SOURCE=2 conftest.c >&5
configure:2586: $? = 0
configure:2632: result: a.out
configure:2637: checking whether the C compiler works
configure:2643: ./a.out
configure:2646: $? = 0
configure:2663: result: yes
configure:2670: checking whether we are cross compiling
configure:2672: result: no
configure:2675: checking for suffix of executables
configure:2677: gcc -o conftest -O2 -g -m32 -march=i486 -fmessage-length=0 -D_FORTIFY_SOURCE=2 conftest.c >&5
configure:2680: $? = 0
configure:2705: result:
configure:2711: checking for suffix of object files
configure:2732: gcc -c -O2 -g -m32 -march=i486 -fmessage-length=0 -D_FORTIFY_SOURCE=2 conftest.c >&5
configure:2735: $? = 0
configure:2757: result: o
configure:2761: checking whether we are using the GNU C compiler
configure:2785: gcc -c -O2 -g -m32 -march=i486 -fmessage-length=0 -D_FORTIFY_SOURCE=2 conftest.c >&5
configure:2791: $? = 0
configure:2794: test -z || test ! -s conftest.err
configure:2797: $? = 0
configure:2800: test -s conftest.o
configure:2803: $? = 0
configure:2816: result: yes
configure:2822: checking whether gcc accepts -g
configure:2843: gcc -c -g conftest.c >&5
configure:2849: $? = 0
configure:2852: test -z || test ! -s conftest.err
configure:2855: $? = 0
configure:2858: test -s conftest.o
configure:2861: $? = 0
configure:2872: result: yes
configure:2889: checking for gcc option to accept ANSI C
configure:2959: gcc -c -O2 -g -m32 -march=i486 -fmessage-length=0 -D_FORTIFY_SOURCE=2 conftest.c >&5
configure:2965: $? = 0
configure:2968: test -z || test ! -s conftest.err
configure:2971: $? = 0
configure:2974: test -s conftest.o
configure:2977: $? = 0
configure:2995: result: none needed
configure:3013: gcc -c -O2 -g -m32 -march=i486 -fmessage-length=0 -D_FORTIFY_SOURCE=2 conftest.c >&5
conftest.c:2: error: expected '=', ',', ';', 'asm' or '__attribute__' before 'me'
configure:3019: $? = 1
configure: failed program was:
| #ifndef __cplusplus
| choke me
| #endif
configure:3151: checking dependency style of gcc
configure:3234: result: gcc3
configure:3257: checking how to run the C preprocessor
configure:3292: gcc -E conftest.c
configure:3298: $? = 0
configure:3330: gcc -E conftest.c
conftest.c:11:28: error: ac_nonexistent.h: No such file or directory
configure:3336: $? = 1
configure: failed program was:
| /* confdefs.h. */
|
| #define PACKAGE_NAME ""
| #define PACKAGE_TARNAME ""
| #define PACKAGE_VERSION ""
| #define PACKAGE_STRING ""
| #define PACKAGE_BUGREPORT ""
| #define PACKAGE "kcometen3"
| #define VERSION "1.1"
| /* end confdefs.h. */
| #include <ac_nonexistent.h>
configure:3375: result: gcc -E
configure:3399: gcc -E conftest.c
configure:3405: $? = 0
configure:3437: gcc -E conftest.c
conftest.c:11:28: error: ac_nonexistent.h: No such file or directory
configure:3443: $? = 1
configure: failed program was:
| /* confdefs.h. */
|
| #define PACKAGE_NAME ""
| #define PACKAGE_TARNAME ""
| #define PACKAGE_VERSION ""
| #define PACKAGE_STRING ""
| #define PACKAGE_BUGREPORT ""
| #define PACKAGE "kcometen3"
| #define VERSION "1.1"
| /* end confdefs.h. */
| #include <ac_nonexistent.h>
configure:3567: checking for g++
configure:3583: found /usr/bin/g++
configure:3593: result: g++
configure:3609: checking for C++ compiler version
configure:3612: g++ --version </dev/null >&5
g++ (GCC) 4.2.3 20071030 (prerelease) (SUSE Linux)
Copyright (C) 2007 Free Software Foundation, Inc.
This is free software; see the source for copying conditions. There is NO
warranty; not even for MERCHANTABILITY or FITNESS FOR A PARTICULAR PURPOSE.

configure:3615: $? = 0
configure:3617: g++ -v </dev/null >&5
Using built-in specs.
Target: x86_64-suse-linux
Configured with: ../configure --enable-threads=posix --prefix=/usr --with-local-prefix=/usr/local --infodir=/usr/share/info --mandir=/usr/share/man --libdir=/usr/lib64 --libexecdir=/usr/lib64 --enable-languages=c,c++,objc,fortran,obj-c++,java,ada --enable-checking=release --with-gxx-include-dir=/usr/include/c++/4.2.3 --enable-ssp --disable-libssp --disable-libgcj --with-slibdir=/lib64 --with-system-zlib --enable-shared --enable-__cxa_atexit --enable-libstdcxx-allocator=new --disable-libstdcxx-pch --program-suffix=-4.2 --enable-version-specific-runtime-libs --without-system-libunwind --with-cpu=generic --host=x86_64-suse-linux
Thread model: posix
gcc version 4.2.3 20071030 (prerelease) (SUSE Linux)
configure:3620: $? = 0
configure:3622: g++ -V </dev/null >&5
g++: '-V' option must have argument
configure:3625: $? = 1
configure:3628: checking whether we are using the GNU C++ compiler
configure:3652: g++ -c -O2 -g -m32 -march=i486 -fmessage-length=0 -D_FORTIFY_SOURCE=2 conftest.cc >&5
configure:3658: $? = 0
configure:3661: test -z || test ! -s conftest.err
configure:3664: $? = 0
configure:3667: test -s conftest.o
configure:3670: $? = 0
configure:3683: result: yes
configure:3689: checking whether g++ accepts -g
configure:3710: g++ -c -g conftest.cc >&5
configure:3716: $? = 0
configure:3719: test -z || test ! -s conftest.err
configure:3722: $? = 0
configure:3725: test -s conftest.o
configure:3728: $? = 0
configure:3739: result: yes
configure:3781: g++ -c -O2 -g -m32 -march=i486 -fmessage-length=0 -D_FORTIFY_SOURCE=2 conftest.cc >&5
configure:3787: $? = 0
configure:3790: test -z || test ! -s conftest.err
configure:3793: $? = 0
configure:3796: test -s conftest.o
configure:3799: $? = 0
configure:3825: g++ -c -O2 -g -m32 -march=i486 -fmessage-length=0 -D_FORTIFY_SOURCE=2 conftest.cc >&5
conftest.cc: In function 'int main()':
conftest.cc:15: error: 'exit' was not declared in this scope
configure:3831: $? = 1
configure: failed program was:
| /* confdefs.h. */
|
| #define PACKAGE_NAME ""
| #define PACKAGE_TARNAME ""
| #define PACKAGE_VERSION ""
| #define PACKAGE_STRING ""
| #define PACKAGE_BUGREPORT ""
| #define PACKAGE "kcometen3"
| #define VERSION "1.1"
| /* end confdefs.h. */
|
| int
| main ()
| {
| exit (42);
| ;
| return 0;
| }
configure:3781: g++ -c -O2 -g -m32 -march=i486 -fmessage-length=0 -D_FORTIFY_SOURCE=2 conftest.cc >&5
conftest.cc:11: error: 'void std::exit(int)' should have been declared inside 'std'
configure:3787: $? = 1
configure: failed program was:
| /* confdefs.h. */
|
| #define PACKAGE_NAME ""
| #define PACKAGE_TARNAME ""
| #define PACKAGE_VERSION ""
| #define PACKAGE_STRING ""
| #define PACKAGE_BUGREPORT ""
| #define PACKAGE "kcometen3"
| #define VERSION "1.1"
| /* end confdefs.h. */
| extern "C" void std::exit (int) throw (); using std::exit;
| #include <stdlib.h>
| int
| main ()
| {
| exit (42);
| ;
| return 0;
| }
configure:3781: g++ -c -O2 -g -m32 -march=i486 -fmessage-length=0 -D_FORTIFY_SOURCE=2 conftest.cc >&5
conftest.cc:11: error: 'void std::exit(int)' should have been declared inside 'std'
In file included from conftest.cc:12:
/usr/include/stdlib.h:646: error: declaration of 'void std::exit(int) throw ()' throws different exceptions
conftest.cc:11: error: from previous declaration 'void std::exit(int)'
configure:3787: $? = 1
configure: failed program was:
| /* confdefs.h. */
|
| #define PACKAGE_NAME ""
| #define PACKAGE_TARNAME ""
| #define PACKAGE_VERSION ""
| #define PACKAGE_STRING ""
| #define PACKAGE_BUGREPORT ""
| #define PACKAGE "kcometen3"
| #define VERSION "1.1"
| /* end confdefs.h. */
| extern "C" void std::exit (int); using std::exit;
| #include <stdlib.h>
| int
| main ()
| {
| exit (42);
| ;
| return 0;
| }
configure:3781: g++ -c -O2 -g -m32 -march=i486 -fmessage-length=0 -D_FORTIFY_SOURCE=2 conftest.cc >&5
configure:3787: $? = 0
configure:3790: test -z || test ! -s conftest.err
configure:3793: $? = 0
configure:3796: test -s conftest.o
configure:3799: $? = 0
configure:3825: g++ -c -O2 -g -m32 -march=i486 -fmessage-length=0 -D_FORTIFY_SOURCE=2 conftest.cc >&5
configure:3831: $? = 0
configure:3834: test -z || test ! -s conftest.err
configure:3837: $? = 0
configure:3840: test -s conftest.o
configure:3843: $? = 0
configure:3868: checking dependency style of g++
configure:3951: result: gcc3
configure:4271: checking whether g++ supports -Wmissing-format-attribute
configure:4307: rm -rf SunWS_cache; g++ -o conftest -ansi -D_XOPEN_SOURCE=500 -D_BSD_SOURCE -Wcast-align -Wconversion -Wchar-subscripts -O2 -O2 -g -m32 -march=i486 -fmessage-length=0 -D_FORTIFY_SOURCE=2 -Wmissing-format-attribute conftest.cc 1>&5
/usr/lib64/gcc/x86_64-suse-linux/4.2.3/../../../../x86_64-suse-linux/bin/ld: skipping incompatible /usr/lib64/gcc/x86_64-suse-linux/4.2.3/libstdc++.so when searching for -lstdc++
/usr/lib64/gcc/x86_64-suse-linux/4.2.3/../../../../x86_64-suse-linux/bin/ld: skipping incompatible /usr/lib64/gcc/x86_64-suse-linux/4.2.3/libstdc++.a when searching for -lstdc++
/usr/lib64/gcc/x86_64-suse-linux/4.2.3/../../../../x86_64-suse-linux/bin/ld: cannot find -lstdc++
collect2: ld returned 1 exit status
configure:4313: $? = 1
configure: failed program was:
| /* confdefs.h. */
|
| #define PACKAGE_NAME ""
| #define PACKAGE_TARNAME ""
| #define PACKAGE_VERSION ""
| #define PACKAGE_STRING ""
| #define PACKAGE_BUGREPORT ""
| #define PACKAGE "kcometen3"
| #define VERSION "1.1"
| #ifdef __cplusplus
| extern "C" void exit (int) throw ();
| #endif
| /* end confdefs.h. */
|
| int
| main ()
| {
| return 0;
| ;
| return 0;
| }
configure:4351: result: no
configure:4361: checking whether g++ supports -Wundef
configure:4397: rm -rf SunWS_cache; g++ -o conftest -Wall -W -Wpointer-arith -Wwrite-strings -ansi -D_XOPEN_SOURCE=500 -D_BSD_SOURCE -Wcast-align -Wconversion -Wchar-subscripts -O2 -O2 -g -m32 -march=i486 -fmessage-length=0 -D_FORTIFY_SOURCE=2 -Wundef conftest.cc 1>&5
/usr/lib64/gcc/x86_64-suse-linux/4.2.3/../../../../x86_64-suse-linux/bin/ld: skipping incompatible /usr/lib64/gcc/x86_64-suse-linux/4.2.3/libstdc++.so when searching for -lstdc++
/usr/lib64/gcc/x86_64-suse-linux/4.2.3/../../../../x86_64-suse-linux/bin/ld: skipping incompatible /usr/lib64/gcc/x86_64-suse-linux/4.2.3/libstdc++.a when searching for -lstdc++
/usr/lib64/gcc/x86_64-suse-linux/4.2.3/../../../../x86_64-suse-linux/bin/ld: cannot find -lstdc++
collect2: ld returned 1 exit status
configure:4403: $? = 1
configure: failed program was:
| /* confdefs.h. */
|
| #define PACKAGE_NAME ""
| #define PACKAGE_TARNAME ""
| #define PACKAGE_VERSION ""
| #define PACKAGE_STRING ""
| #define PACKAGE_BUGREPORT ""
| #define PACKAGE "kcometen3"
| #define VERSION "1.1"
| #ifdef __cplusplus
| extern "C" void exit (int) throw ();
| #endif
| /* end confdefs.h. */
|
| int
| main ()
| {
| return 0;
| ;
| return 0;
| }
configure:4441: result: no
configure:4448: checking whether g++ supports -Wno-long-long
configure:4484: rm -rf SunWS_cache; g++ -o conftest -Wall -W -Wpointer-arith -Wwrite-strings -ansi -D_XOPEN_SOURCE=500 -D_BSD_SOURCE -Wcast-align -Wconversion -Wchar-subscripts -O2 -O2 -g -m32 -march=i486 -fmessage-length=0 -D_FORTIFY_SOURCE=2 -Wno-long-long conftest.cc 1>&5
/usr/lib64/gcc/x86_64-suse-linux/4.2.3/../../../../x86_64-suse-linux/bin/ld: skipping incompatible /usr/lib64/gcc/x86_64-suse-linux/4.2.3/libstdc++.so when searching for -lstdc++
/usr/lib64/gcc/x86_64-suse-linux/4.2.3/../../../../x86_64-suse-linux/bin/ld: skipping incompatible /usr/lib64/gcc/x86_64-suse-linux/4.2.3/libstdc++.a when searching for -lstdc++
/usr/lib64/gcc/x86_64-suse-linux/4.2.3/../../../../x86_64-suse-linux/bin/ld: cannot find -lstdc++
collect2: ld returned 1 exit status
configure:4490: $? = 1
configure: failed program was:
| /* confdefs.h. */
|
| #define PACKAGE_NAME ""
| #define PACKAGE_TARNAME ""
| #define PACKAGE_VERSION ""
| #define PACKAGE_STRING ""
| #define PACKAGE_BUGREPORT ""
| #define PACKAGE "kcometen3"
| #define VERSION "1.1"
| #ifdef __cplusplus
| extern "C" void exit (int) throw ();
| #endif
| /* end confdefs.h. */
|
| int
| main ()
| {
| return 0;
| ;
| return 0;
| }
configure:4528: result: no
configure:4535: checking whether g++ supports -Wnon-virtual-dtor
configure:4571: rm -rf SunWS_cache; g++ -o conftest -Wall -W -Wpointer-arith -Wwrite-strings -ansi -D_XOPEN_SOURCE=500 -D_BSD_SOURCE -Wcast-align -Wconversion -Wchar-subscripts -O2 -O2 -g -m32 -march=i486 -fmessage-length=0 -D_FORTIFY_SOURCE=2 -Wnon-virtual-dtor conftest.cc 1>&5
/usr/lib64/gcc/x86_64-suse-linux/4.2.3/../../../../x86_64-suse-linux/bin/ld: skipping incompatible /usr/lib64/gcc/x86_64-suse-linux/4.2.3/libstdc++.so when searching for -lstdc++
/usr/lib64/gcc/x86_64-suse-linux/4.2.3/../../../../x86_64-suse-linux/bin/ld: skipping incompatible /usr/lib64/gcc/x86_64-suse-linux/4.2.3/libstdc++.a when searching for -lstdc++
/usr/lib64/gcc/x86_64-suse-linux/4.2.3/../../../../x86_64-suse-linux/bin/ld: cannot find -lstdc++
collect2: ld returned 1 exit status
configure:4577: $? = 1
configure: failed program was:
| /* confdefs.h. */
|
| #define PACKAGE_NAME ""
| #define PACKAGE_TARNAME ""
| #define PACKAGE_VERSION ""
| #define PACKAGE_STRING ""
| #define PACKAGE_BUGREPORT ""
| #define PACKAGE "kcometen3"
| #define VERSION "1.1"
| #ifdef __cplusplus
| extern "C" void exit (int) throw ();
| #endif
| /* end confdefs.h. */
|
| int
| main ()
| {
| return 0;
| ;
| return 0;
| }
configure:4615: result: no
configure:4630: checking whether g++ supports -fno-exceptions
configure:4666: rm -rf SunWS_cache; g++ -o conftest -Wall -W -Wpointer-arith -Wwrite-strings -ansi -D_XOPEN_SOURCE=500 -D_BSD_SOURCE -Wcast-align -Wconversion -Wchar-subscripts -O2 -O2 -g -m32 -march=i486 -fmessage-length=0 -D_FORTIFY_SOURCE=2 -fno-exceptions conftest.cc 1>&5
/usr/lib64/gcc/x86_64-suse-linux/4.2.3/../../../../x86_64-suse-linux/bin/ld: skipping incompatible /usr/lib64/gcc/x86_64-suse-linux/4.2.3/libstdc++.so when searching for -lstdc++
/usr/lib64/gcc/x86_64-suse-linux/4.2.3/../../../../x86_64-suse-linux/bin/ld: skipping incompatible /usr/lib64/gcc/x86_64-suse-linux/4.2.3/libstdc++.a when searching for -lstdc++
/usr/lib64/gcc/x86_64-suse-linux/4.2.3/../../../../x86_64-suse-linux/bin/ld: cannot find -lstdc++
collect2: ld returned 1 exit status
configure:4672: $? = 1
configure: failed program was:
| /* confdefs.h. */
|
| #define PACKAGE_NAME ""
| #define PACKAGE_TARNAME ""
| #define PACKAGE_VERSION ""
| #define PACKAGE_STRING ""
| #define PACKAGE_BUGREPORT ""
| #define PACKAGE "kcometen3"
| #define VERSION "1.1"
| #ifdef __cplusplus
| extern "C" void exit (int) throw ();
| #endif
| /* end confdefs.h. */
|
| int
| main ()
| {
| return 0;
| ;
| return 0;
| }
configure:4710: result: no
configure:4717: checking whether g++ supports -fno-check-new
configure:4753: rm -rf SunWS_cache; g++ -o conftest -Wall -W -Wpointer-arith -Wwrite-strings -ansi -D_XOPEN_SOURCE=500 -D_BSD_SOURCE -Wcast-align -Wconversion -Wchar-subscripts -O2 -O2 -g -m32 -march=i486 -fmessage-length=0 -D_FORTIFY_SOURCE=2 -fno-check-new conftest.cc 1>&5
/usr/lib64/gcc/x86_64-suse-linux/4.2.3/../../../../x86_64-suse-linux/bin/ld: skipping incompatible /usr/lib64/gcc/x86_64-suse-linux/4.2.3/libstdc++.so when searching for -lstdc++
/usr/lib64/gcc/x86_64-suse-linux/4.2.3/../../../../x86_64-suse-linux/bin/ld: skipping incompatible /usr/lib64/gcc/x86_64-suse-linux/4.2.3/libstdc++.a when searching for -lstdc++
/usr/lib64/gcc/x86_64-suse-linux/4.2.3/../../../../x86_64-suse-linux/bin/ld: cannot find -lstdc++
collect2: ld returned 1 exit status
configure:4759: $? = 1
configure: failed program was:
| /* confdefs.h. */
|
| #define PACKAGE_NAME ""
| #define PACKAGE_TARNAME ""
| #define PACKAGE_VERSION ""
| #define PACKAGE_STRING ""
| #define PACKAGE_BUGREPORT ""
| #define PACKAGE "kcometen3"
| #define VERSION "1.1"
| #ifdef __cplusplus
| extern "C" void exit (int) throw ();
| #endif
| /* end confdefs.h. */
|
| int
| main ()
| {
| return 0;
| ;
| return 0;
| }
configure:4797: result: no
configure:4804: checking whether g++ supports -fno-common
configure:4840: rm -rf SunWS_cache; g++ -o conftest -Wall -W -Wpointer-arith -Wwrite-strings -ansi -D_XOPEN_SOURCE=500 -D_BSD_SOURCE -Wcast-align -Wconversion -Wchar-subscripts -O2 -O2 -g -m32 -march=i486 -fmessage-length=0 -D_FORTIFY_SOURCE=2 -fno-common conftest.cc 1>&5
/usr/lib64/gcc/x86_64-suse-linux/4.2.3/../../../../x86_64-suse-linux/bin/ld: skipping incompatible /usr/lib64/gcc/x86_64-suse-linux/4.2.3/libstdc++.so when searching for -lstdc++
/usr/lib64/gcc/x86_64-suse-linux/4.2.3/../../../../x86_64-suse-linux/bin/ld: skipping incompatible /usr/lib64/gcc/x86_64-suse-linux/4.2.3/libstdc++.a when searching for -lstdc++
/usr/lib64/gcc/x86_64-suse-linux/4.2.3/../../../../x86_64-suse-linux/bin/ld: cannot find -lstdc++
collect2: ld returned 1 exit status
configure:4846: $? = 1
configure: failed program was:
| /* confdefs.h. */
|
| #define PACKAGE_NAME ""
| #define PACKAGE_TARNAME ""
| #define PACKAGE_VERSION ""
| #define PACKAGE_STRING ""
| #define PACKAGE_BUGREPORT ""
| #define PACKAGE "kcometen3"
| #define VERSION "1.1"
| #ifdef __cplusplus
| extern "C" void exit (int) throw ();
| #endif
| /* end confdefs.h. */
|
| int
| main ()
| {
| return 0;
| ;
| return 0;
| }
configure:4884: result: no
configure:4891: checking whether g++ supports -fexceptions
configure:4927: rm -rf SunWS_cache; g++ -o conftest -Wall -W -Wpointer-arith -Wwrite-strings -ansi -D_XOPEN_SOURCE=500 -D_BSD_SOURCE -Wcast-align -Wconversion -Wchar-subscripts -O2 -O2 -g -m32 -march=i486 -fmessage-length=0 -D_FORTIFY_SOURCE=2 -fexceptions conftest.cc 1>&5
/usr/lib64/gcc/x86_64-suse-linux/4.2.3/../../../../x86_64-suse-linux/bin/ld: skipping incompatible /usr/lib64/gcc/x86_64-suse-linux/4.2.3/libstdc++.so when searching for -lstdc++
/usr/lib64/gcc/x86_64-suse-linux/4.2.3/../../../../x86_64-suse-linux/bin/ld: skipping incompatible /usr/lib64/gcc/x86_64-suse-linux/4.2.3/libstdc++.a when searching for -lstdc++
/usr/lib64/gcc/x86_64-suse-linux/4.2.3/../../../../x86_64-suse-linux/bin/ld: cannot find -lstdc++
collect2: ld returned 1 exit status
configure:4933: $? = 1
configure: failed program was:
| /* confdefs.h. */
|
| #define PACKAGE_NAME ""
| #define PACKAGE_TARNAME ""
| #define PACKAGE_VERSION ""
| #define PACKAGE_STRING ""
| #define PACKAGE_BUGREPORT ""
| #define PACKAGE "kcometen3"
| #define VERSION "1.1"
| #ifdef __cplusplus
| extern "C" void exit (int) throw ();
| #endif
| /* end confdefs.h. */
|
| int
| main ()
| {
| return 0;
| ;
| return 0;
| }
configure:4971: result: no
configure:5621: checking how to run the C++ preprocessor
configure:5652: g++ -E conftest.cc
configure:5658: $? = 0
configure:5690: g++ -E conftest.cc
conftest.cc:14:28: error: ac_nonexistent.h: No such file or directory
configure:5696: $? = 1
configure: failed program was:
| /* confdefs.h. */
|
| #define PACKAGE_NAME ""
| #define PACKAGE_TARNAME ""
| #define PACKAGE_VERSION ""
| #define PACKAGE_STRING ""
| #define PACKAGE_BUGREPORT ""
| #define PACKAGE "kcometen3"
| #define VERSION "1.1"
| #ifdef __cplusplus
| extern "C" void exit (int) throw ();
| #endif
| /* end confdefs.h. */
| #include <ac_nonexistent.h>
configure:5735: result: g++ -E
configure:5759: g++ -E conftest.cc
configure:5765: $? = 0
configure:5797: g++ -E conftest.cc
conftest.cc:14:28: error: ac_nonexistent.h: No such file or directory
configure:5803: $? = 1
configure: failed program was:
| /* confdefs.h. */
|
| #define PACKAGE_NAME ""
| #define PACKAGE_TARNAME ""
| #define PACKAGE_VERSION ""
| #define PACKAGE_STRING ""
| #define PACKAGE_BUGREPORT ""
| #define PACKAGE "kcometen3"
| #define VERSION "1.1"
| #ifdef __cplusplus
| extern "C" void exit (int) throw ();
| #endif
| /* end confdefs.h. */
| #include <ac_nonexistent.h>
configure:5851: checking whether g++ supports -O0
configure:5887: rm -rf SunWS_cache; g++ -o conftest -Wall -W -Wpointer-arith -Wwrite-strings -ansi -D_XOPEN_SOURCE=500 -D_BSD_SOURCE -Wcast-align -Wconversion -Wchar-subscripts -O2 -O2 -g -m32 -march=i486 -fmessage-length=0 -D_FORTIFY_SOURCE=2 -O0 conftest.cc 1>&5
/usr/lib64/gcc/x86_64-suse-linux/4.2.3/../../../../x86_64-suse-linux/bin/ld: skipping incompatible /usr/lib64/gcc/x86_64-suse-linux/4.2.3/libstdc++.so when searching for -lstdc++
/usr/lib64/gcc/x86_64-suse-linux/4.2.3/../../../../x86_64-suse-linux/bin/ld: skipping incompatible /usr/lib64/gcc/x86_64-suse-linux/4.2.3/libstdc++.a when searching for -lstdc++
/usr/lib64/gcc/x86_64-suse-linux/4.2.3/../../../../x86_64-suse-linux/bin/ld: cannot find -lstdc++
collect2: ld returned 1 exit status
configure:5893: $? = 1
configure: failed program was:
| /* confdefs.h. */
|
| #define PACKAGE_NAME ""
| #define PACKAGE_TARNAME ""
| #define PACKAGE_VERSION ""
| #define PACKAGE_STRING ""
| #define PACKAGE_BUGREPORT ""
| #define PACKAGE "kcometen3"
| #define VERSION "1.1"
| #ifdef __cplusplus
| extern "C" void exit (int) throw ();
| #endif
| /* end confdefs.h. */
|
| int
| main ()
| {
| return 0;
| ;
| return 0;
| }
configure:5931: result: no
configure:5981: checking whether g++ supports -Wl,--no-undefined
configure:6017: rm -rf SunWS_cache; g++ -o conftest -Wall -W -Wpointer-arith -Wwrite-strings -ansi -D_XOPEN_SOURCE=500 -D_BSD_SOURCE -Wcast-align -Wconversion -Wchar-subscripts -O2 -O2 -g -m32 -march=i486 -fmessage-length=0 -D_FORTIFY_SOURCE=2 -Wl,--no-undefined conftest.cc 1>&5
/usr/lib64/gcc/x86_64-suse-linux/4.2.3/../../../../x86_64-suse-linux/bin/ld: skipping incompatible /usr/lib64/gcc/x86_64-suse-linux/4.2.3/libstdc++.so when searching for -lstdc++
/usr/lib64/gcc/x86_64-suse-linux/4.2.3/../../../../x86_64-suse-linux/bin/ld: skipping incompatible /usr/lib64/gcc/x86_64-suse-linux/4.2.3/libstdc++.a when searching for -lstdc++
/usr/lib64/gcc/x86_64-suse-linux/4.2.3/../../../../x86_64-suse-linux/bin/ld: cannot find -lstdc++
collect2: ld returned 1 exit status
configure:6023: $? = 1
configure: failed program was:
| /* confdefs.h. */
|
| #define PACKAGE_NAME ""
| #define PACKAGE_TARNAME ""
| #define PACKAGE_VERSION ""
| #define PACKAGE_STRING ""
| #define PACKAGE_BUGREPORT ""
| #define PACKAGE "kcometen3"
| #define VERSION "1.1"
| #ifdef __cplusplus
| extern "C" void exit (int) throw ();
| #endif
| /* end confdefs.h. */
|
| int
| main ()
| {
| return 0;
| ;
| return 0;
| }
configure:6147: result: no
configure:6245: result: not using lib directory suffix
configure:6290: checking for a sed that does not truncate output
configure:6344: result: /bin/sed
configure:6347: checking for egrep
configure:6357: result: grep -E
configure:6373: checking for ld used by gcc
configure:6440: result: /usr/x86_64-suse-linux/bin/ld
configure:6449: checking if the linker (/usr/x86_64-suse-linux/bin/ld) is GNU ld
configure:6464: result: yes
configure:6469: checking for /usr/x86_64-suse-linux/bin/ld option to reload object files
configure:6476: result: -r
configure:6485: checking for BSD-compatible nm
configure:6527: result: /usr/bin/nm -B
configure:6531: checking whether ln -s works
configure:6535: result: yes
configure:6542: checking how to recognise dependent libraries
configure:6745: result: pass_all
configure:6828: gcc -c -ansi -W -Wall -Wchar-subscripts -Wshadow -Wpointer-arith -Wmissing-prototypes -Wwrite-strings -D_XOPEN_SOURCE=500 -D_BSD_SOURCE -O2 -O2 -g -m32 -march=i486 -fmessage-length=0 -D_FORTIFY_SOURCE=2 conftest.c >&5
configure:6831: $? = 0
configure:6954: checking for ANSI C header files
configure:6979: gcc -c -ansi -W -Wall -Wchar-subscripts -Wshadow -Wpointer-arith -Wmissing-prototypes -Wwrite-strings -D_XOPEN_SOURCE=500 -D_BSD_SOURCE -O2 -O2 -g -m32 -march=i486 -fmessage-length=0 -D_FORTIFY_SOURCE=2 conftest.c >&5
configure:6985: $? = 0
configure:6988: test -z || test ! -s conftest.err
configure:6991: $? = 0
configure:6994: test -s conftest.o
configure:6997: $? = 0
configure:7086: gcc -o conftest -ansi -W -Wall -Wchar-subscripts -Wshadow -Wpointer-arith -Wmissing-prototypes -Wwrite-strings -D_XOPEN_SOURCE=500 -D_BSD_SOURCE -O2 -O2 -g -m32 -march=i486 -fmessage-length=0 -D_FORTIFY_SOURCE=2 conftest.c >&5
conftest.c: In function 'main':
conftest.c:32: warning: implicit declaration of function 'exit'
conftest.c:32: warning: incompatible implicit declaration of built-in function 'exit'
configure:7089: $? = 0
configure:7091: ./conftest
configure:7094: $? = 0
configure:7109: result: yes
configure:7133: checking for sys/types.h
configure:7149: gcc -c -ansi -W -Wall -Wchar-subscripts -Wshadow -Wpointer-arith -Wmissing-prototypes -Wwrite-strings -D_XOPEN_SOURCE=500 -D_BSD_SOURCE -O2 -O2 -g -m32 -march=i486 -fmessage-length=0 -D_FORTIFY_SOURCE=2 conftest.c >&5
configure:7155: $? = 0
configure:7158: test -z || test ! -s conftest.err
configure:7161: $? = 0
configure:7164: test -s conftest.o
configure:7167: $? = 0
configure:7178: result: yes
configure:7133: checking for sys/stat.h
configure:7149: gcc -c -ansi -W -Wall -Wchar-subscripts -Wshadow -Wpointer-arith -Wmissing-prototypes -Wwrite-strings -D_XOPEN_SOURCE=500 -D_BSD_SOURCE -O2 -O2 -g -m32 -march=i486 -fmessage-length=0 -D_FORTIFY_SOURCE=2 conftest.c >&5
configure:7155: $? = 0
configure:7158: test -z || test ! -s conftest.err
configure:7161: $? = 0
configure:7164: test -s conftest.o
configure:7167: $? = 0
configure:7178: result: yes
configure:7133: checking for stdlib.h
configure:7149: gcc -c -ansi -W -Wall -Wchar-subscripts -Wshadow -Wpointer-arith -Wmissing-prototypes -Wwrite-strings -D_XOPEN_SOURCE=500 -D_BSD_SOURCE -O2 -O2 -g -m32 -march=i486 -fmessage-length=0 -D_FORTIFY_SOURCE=2 conftest.c >&5
configure:7155: $? = 0
configure:7158: test -z || test ! -s conftest.err
configure:7161: $? = 0
configure:7164: test -s conftest.o
configure:7167: $? = 0
configure:7178: result: yes
configure:7133: checking for string.h
configure:7149: gcc -c -ansi -W -Wall -Wchar-subscripts -Wshadow -Wpointer-arith -Wmissing-prototypes -Wwrite-strings -D_XOPEN_SOURCE=500 -D_BSD_SOURCE -O2 -O2 -g -m32 -march=i486 -fmessage-length=0 -D_FORTIFY_SOURCE=2 conftest.c >&5
configure:7155: $? = 0
configure:7158: test -z || test ! -s conftest.err
configure:7161: $? = 0
configure:7164: test -s conftest.o
configure:7167: $? = 0
configure:7178: result: yes
configure:7133: checking for memory.h
configure:7149: gcc -c -ansi -W -Wall -Wchar-subscripts -Wshadow -Wpointer-arith -Wmissing-prototypes -Wwrite-strings -D_XOPEN_SOURCE=500 -D_BSD_SOURCE -O2 -O2 -g -m32 -march=i486 -fmessage-length=0 -D_FORTIFY_SOURCE=2 conftest.c >&5
configure:7155: $? = 0
configure:7158: test -z || test ! -s conftest.err
configure:7161: $? = 0
configure:7164: test -s conftest.o
configure:7167: $? = 0
configure:7178: result: yes
configure:7133: checking for strings.h
configure:7149: gcc -c -ansi -W -Wall -Wchar-subscripts -Wshadow -Wpointer-arith -Wmissing-prototypes -Wwrite-strings -D_XOPEN_SOURCE=500 -D_BSD_SOURCE -O2 -O2 -g -m32 -march=i486 -fmessage-length=0 -D_FORTIFY_SOURCE=2 conftest.c >&5
configure:7155: $? = 0
configure:7158: test -z || test ! -s conftest.err
configure:7161: $? = 0
configure:7164: test -s conftest.o
configure:7167: $? = 0
configure:7178: result: yes
configure:7133: checking for inttypes.h
configure:7149: gcc -c -ansi -W -Wall -Wchar-subscripts -Wshadow -Wpointer-arith -Wmissing-prototypes -Wwrite-strings -D_XOPEN_SOURCE=500 -D_BSD_SOURCE -O2 -O2 -g -m32 -march=i486 -fmessage-length=0 -D_FORTIFY_SOURCE=2 conftest.c >&5
configure:7155: $? = 0
configure:7158: test -z || test ! -s conftest.err
configure:7161: $? = 0
configure:7164: test -s conftest.o
configure:7167: $? = 0
configure:7178: result: yes
configure:7133: checking for stdint.h
configure:7149: gcc -c -ansi -W -Wall -Wchar-subscripts -Wshadow -Wpointer-arith -Wmissing-prototypes -Wwrite-strings -D_XOPEN_SOURCE=500 -D_BSD_SOURCE -O2 -O2 -g -m32 -march=i486 -fmessage-length=0 -D_FORTIFY_SOURCE=2 conftest.c >&5
configure:7155: $? = 0
configure:7158: test -z || test ! -s conftest.err
configure:7161: $? = 0
configure:7164: test -s conftest.o
configure:7167: $? = 0
configure:7178: result: yes
configure:7133: checking for unistd.h
configure:7149: gcc -c -ansi -W -Wall -Wchar-subscripts -Wshadow -Wpointer-arith -Wmissing-prototypes -Wwrite-strings -D_XOPEN_SOURCE=500 -D_BSD_SOURCE -O2 -O2 -g -m32 -march=i486 -fmessage-length=0 -D_FORTIFY_SOURCE=2 conftest.c >&5
configure:7155: $? = 0
configure:7158: test -z || test ! -s conftest.err
configure:7161: $? = 0
configure:7164: test -s conftest.o
configure:7167: $? = 0
configure:7178: result: yes
configure:7204: checking dlfcn.h usability
configure:7216: gcc -c -ansi -W -Wall -Wchar-subscripts -Wshadow -Wpointer-arith -Wmissing-prototypes -Wwrite-strings -D_XOPEN_SOURCE=500 -D_BSD_SOURCE -O2 -O2 -g -m32 -march=i486 -fmessage-length=0 -D_FORTIFY_SOURCE=2 conftest.c >&5
configure:7222: $? = 0
configure:7225: test -z || test ! -s conftest.err
configure:7228: $? = 0
configure:7231: test -s conftest.o
configure:7234: $? = 0
configure:7244: result: yes
configure:7248: checking dlfcn.h presence
configure:7258: gcc -E conftest.c
configure:7264: $? = 0
configure:7284: result: yes
configure:7319: checking for dlfcn.h
configure:7326: result: yes
configure:7390: checking for g77
configure:7419: result: no
configure:7390: checking for f77
configure:7419: result: no
configure:7390: checking for xlf
configure:7419: result: no
configure:7390: checking for frt
configure:7419: result: no
configure:7390: checking for pgf77
configure:7419: result: no
configure:7390: checking for fort77
configure:7419: result: no
configure:7390: checking for fl32
configure:7419: result: no
configure:7390: checking for af77
configure:7419: result: no
configure:7390: checking for f90
configure:7419: result: no
configure:7390: checking for xlf90
configure:7419: result: no
configure:7390: checking for pgf90
configure:7419: result: no
configure:7390: checking for epcf90
configure:7419: result: no
configure:7390: checking for f95
configure:7419: result: no
configure:7390: checking for fort
configure:7419: result: no
configure:7390: checking for xlf95
configure:7419: result: no
configure:7390: checking for ifc
configure:7419: result: no
configure:7390: checking for efc
configure:7419: result: no
configure:7390: checking for pgf95
configure:7419: result: no
configure:7390: checking for lf95
configure:7419: result: no
configure:7390: checking for gfortran
configure:7406: found /usr/bin/gfortran
configure:7416: result: gfortran
configure:7431: checking for Fortran 77 compiler version
configure:7434: gfortran --version </dev/null >&5
GNU Fortran (GCC) 4.2.3 20071030 (prerelease) (SUSE Linux)
Copyright (C) 2007 Free Software Foundation, Inc.

GNU Fortran comes with NO WARRANTY, to the extent permitted by law.
You may redistribute copies of GNU Fortran
under the terms of the GNU General Public License.
For more information about these matters, see the file named COPYING

configure:7437: $? = 0
configure:7439: gfortran -v </dev/null >&5
Using built-in specs.
Target: x86_64-suse-linux
Configured with: ../configure --enable-threads=posix --prefix=/usr --with-local-prefix=/usr/local --infodir=/usr/share/info --mandir=/usr/share/man --libdir=/usr/lib64 --libexecdir=/usr/lib64 --enable-languages=c,c++,objc,fortran,obj-c++,java,ada --enable-checking=release --with-gxx-include-dir=/usr/include/c++/4.2.3 --enable-ssp --disable-libssp --disable-libgcj --with-slibdir=/lib64 --with-system-zlib --enable-shared --enable-__cxa_atexit --enable-libstdcxx-allocator=new --disable-libstdcxx-pch --program-suffix=-4.2 --enable-version-specific-runtime-libs --without-system-libunwind --with-cpu=generic --host=x86_64-suse-linux
Thread model: posix
gcc version 4.2.3 20071030 (prerelease) (SUSE Linux)
configure:7442: $? = 0
configure:7444: gfortran -V </dev/null >&5
gfortran: '-V' option must have argument
configure:7447: $? = 1
configure:7455: checking whether we are using the GNU Fortran 77 compiler
configure:7469: gfortran -c conftest.F >&5
configure:7475: $? = 0
configure:7478: test -z || test ! -s conftest.err
configure:7481: $? = 0
configure:7484: test -s conftest.o
configure:7487: $? = 0
configure:7500: result: yes
configure:7506: checking whether gfortran accepts -g
configure:7518: gfortran -c -g conftest.f >&5
configure:7524: $? = 0
configure:7527: test -z || test ! -s conftest.err
configure:7530: $? = 0
configure:7533: test -s conftest.o
configure:7536: $? = 0
configure:7548: result: yes
configure:7578: checking the maximum length of command line arguments
configure:7637: result: 32768
configure:7648: checking command to parse /usr/bin/nm -B output from gcc object
configure:7737: gcc -c -ansi -W -Wall -Wchar-subscripts -Wshadow -Wpointer-arith -Wmissing-prototypes -Wwrite-strings -D_XOPEN_SOURCE=500 -D_BSD_SOURCE -O2 -O2 -g -m32 -march=i486 -fmessage-length=0 -D_FORTIFY_SOURCE=2 conftest.c >&5
conftest.c:5: warning: no previous prototype for 'nm_test_func'
configure:7740: $? = 0
configure:7744: /usr/bin/nm -B conftest.o \| sed -n -e 's/^.*[ ]\([ABCDGISTW][ABCDGISTW]*\)[ ][ ]*\(\)\([_A-Za-z][_A-Za-z0-9]*\)$/\1 \2\3 \3/p' \> conftest.nm
configure:7747: $? = 0
configure:7799: gcc -o conftest -ansi -W -Wall -Wchar-subscripts -Wshadow -Wpointer-arith -Wmissing-prototypes -Wwrite-strings -D_XOPEN_SOURCE=500 -D_BSD_SOURCE -O2 -O2 -g -m32 -march=i486 -fmessage-length=0 -D_FORTIFY_SOURCE=2 conftest.c conftstm.o >&5
configure:7802: $? = 0
configure:7840: result: ok
configure:7844: checking for objdir
configure:7859: result: .libs
configure:7949: checking for ar
configure:7965: found /usr/bin/ar
configure:7976: result: ar
configure:8029: checking for ranlib
configure:8045: found /usr/bin/ranlib
configure:8056: result: ranlib
configure:8109: checking for strip
configure:8125: found /usr/bin/strip
configure:8136: result: strip
configure:8398: checking if gcc static flag works
configure:8421: result: yes
configure:8439: checking if gcc supports -fno-rtti -fno-exceptions
configure:8457: gcc -c -ansi -W -Wall -Wchar-subscripts -Wshadow -Wpointer-arith -Wmissing-prototypes -Wwrite-strings -D_XOPEN_SOURCE=500 -D_BSD_SOURCE -O2 -O2 -g -m32 -march=i486 -fmessage-length=0 -D_FORTIFY_SOURCE=2 -fno-rtti -fno-exceptions conftest.c >&5
cc1: warning: command line option "-fno-rtti" is valid for C++/ObjC++ but not for C
configure:8461: $? = 0
configure:8472: result: no
configure:8487: checking for gcc option to produce PIC
configure:8664: result: -fPIC
configure:8672: checking if gcc PIC flag -fPIC works
configure:8690: gcc -c -ansi -W -Wall -Wchar-subscripts -Wshadow -Wpointer-arith -Wmissing-prototypes -Wwrite-strings -D_XOPEN_SOURCE=500 -D_BSD_SOURCE -O2 -O2 -g -m32 -march=i486 -fmessage-length=0 -D_FORTIFY_SOURCE=2 -fPIC -DPIC conftest.c >&5
configure:8694: $? = 0
configure:8705: result: yes
configure:8729: checking if gcc supports -c -o file.o
configure:8757: gcc -c -ansi -W -Wall -Wchar-subscripts -Wshadow -Wpointer-arith -Wmissing-prototypes -Wwrite-strings -D_XOPEN_SOURCE=500 -D_BSD_SOURCE -O2 -O2 -g -m32 -march=i486 -fmessage-length=0 -D_FORTIFY_SOURCE=2 -o out/conftest2.o conftest.c >&5
configure:8761: $? = 0
configure:8778: result: yes
configure:8804: checking whether the gcc linker (/usr/x86_64-suse-linux/bin/ld -m elf_i386) supports shared libraries
configure:9603: result: yes
configure:9629: checking whether -lc should be explicitly linked in
configure:9634: gcc -c -ansi -W -Wall -Wchar-subscripts -Wshadow -Wpointer-arith -Wmissing-prototypes -Wwrite-strings -D_XOPEN_SOURCE=500 -D_BSD_SOURCE -O2 -O2 -g -m32 -march=i486 -fmessage-length=0 -D_FORTIFY_SOURCE=2 conftest.c >&5
configure:9637: $? = 0
configure:9651: gcc -shared conftest.o -v -Wl,-soname -Wl,conftest -o conftest 2\>\&1 \| grep -lc \>/dev/null 2\>\&1
configure:9654: $? = 0
configure:9666: result: no
configure:9674: checking dynamic linker characteristics
configure:10192: result: GNU/Linux ld.so
configure:10196: checking how to hardcode library paths into programs
configure:10221: result: immediate
configure:10235: checking whether stripping libraries is possible
configure:10240: result: yes
configure:10365: checking for shl_load
configure:10422: gcc -o conftest -ansi -W -Wall -Wchar-subscripts -Wshadow -Wpointer-arith -Wmissing-prototypes -Wwrite-strings -D_XOPEN_SOURCE=500 -D_BSD_SOURCE -O2 -O2 -g -m32 -march=i486 -fmessage-length=0 -D_FORTIFY_SOURCE=2 conftest.c >&5
/tmp/ccW7lwrY.o: In function `main':
/usr/src/packages/BUILD/kcometen3-1.1/conftest.c:65: undefined reference to `shl_load'
/tmp/ccW7lwrY.o:(.data+0x0): undefined reference to `shl_load'
collect2: ld returned 1 exit status
configure:10428: $? = 1
configure: failed program was:
| /* confdefs.h. */
|
| #define PACKAGE_NAME ""
| #define PACKAGE_TARNAME ""
| #define PACKAGE_VERSION ""
| #define PACKAGE_STRING ""
| #define PACKAGE_BUGREPORT ""
| #define PACKAGE "kcometen3"
| #define VERSION "1.1"
| #ifdef __cplusplus
| extern "C" void exit (int) throw ();
| #endif
| #define KDELIBSUFF ""
| #define STDC_HEADERS 1
| #define HAVE_SYS_TYPES_H 1
| #define HAVE_SYS_STAT_H 1
| #define HAVE_STDLIB_H 1
| #define HAVE_STRING_H 1
| #define HAVE_MEMORY_H 1
| #define HAVE_STRINGS_H 1
| #define HAVE_INTTYPES_H 1
| #define HAVE_STDINT_H 1
| #define HAVE_UNISTD_H 1
| #define HAVE_DLFCN_H 1
| /* end confdefs.h. */
| /* Define shl_load to an innocuous variant, in case <limits.h> declares shl_load.
| For example, HP-UX 11i <limits.h> declares gettimeofday. */
| #define shl_load innocuous_shl_load
|
| /* System header to define __stub macros and hopefully few prototypes,
| which can conflict with char shl_load (); below.
| Prefer <limits.h> to <assert.h> if __STDC__ is defined, since
| <limits.h> exists even on freestanding compilers. */
|
| #ifdef __STDC__
| # include <limits.h>
| #else
| # include <assert.h>
| #endif
|
| #undef shl_load
|
| /* Override any gcc2 internal prototype to avoid an error. */
| #ifdef __cplusplus
| extern "C"
| {
| #endif
| /* We use char because int might match the return type of a gcc2
| builtin and then its argument prototype would still apply. */
| char shl_load ();
| /* The GNU C library defines this for functions which it implements
| to always fail with ENOSYS. Some functions are actually named
| something starting with __ and the normal name is an alias. */
| #if defined (__stub_shl_load) || defined (__stub___shl_load)
| choke me
| #else
| char (*f) () = shl_load;
| #endif
| #ifdef __cplusplus
| }
| #endif
|
| int
| main ()
| {
| return f != shl_load;
| ;
| return 0;
| }
configure:10452: result: no
configure:10457: checking for shl_load in -ldld
configure:10487: gcc -o conftest -ansi -W -Wall -Wchar-subscripts -Wshadow -Wpointer-arith -Wmissing-prototypes -Wwrite-strings -D_XOPEN_SOURCE=500 -D_BSD_SOURCE -O2 -O2 -g -m32 -march=i486 -fmessage-length=0 -D_FORTIFY_SOURCE=2 conftest.c -ldld >&5
/usr/lib64/gcc/x86_64-suse-linux/4.2.3/../../../../x86_64-suse-linux/bin/ld: cannot find -ldld
collect2: ld returned 1 exit status
configure:10493: $? = 1
configure: failed program was:
| /* confdefs.h. */
|
| #define PACKAGE_NAME ""
| #define PACKAGE_TARNAME ""
| #define PACKAGE_VERSION ""
| #define PACKAGE_STRING ""
| #define PACKAGE_BUGREPORT ""
| #define PACKAGE "kcometen3"
| #define VERSION "1.1"
| #ifdef __cplusplus
| extern "C" void exit (int) throw ();
| #endif
| #define KDELIBSUFF ""
| #define STDC_HEADERS 1
| #define HAVE_SYS_TYPES_H 1
| #define HAVE_SYS_STAT_H 1
| #define HAVE_STDLIB_H 1
| #define HAVE_STRING_H 1
| #define HAVE_MEMORY_H 1
| #define HAVE_STRINGS_H 1
| #define HAVE_INTTYPES_H 1
| #define HAVE_STDINT_H 1
| #define HAVE_UNISTD_H 1
| #define HAVE_DLFCN_H 1
| /* end confdefs.h. */
|
| /* Override any gcc2 internal prototype to avoid an error. */
| #ifdef __cplusplus
| extern "C"
| #endif
| /* We use char because int might match the return type of a gcc2
| builtin and then its argument prototype would still apply. */
| char shl_load ();
| int
| main ()
| {
| shl_load ();
| ;
| return 0;
| }
configure:10518: result: no
configure:10523: checking for dlopen
configure:10580: gcc -o conftest -ansi -W -Wall -Wchar-subscripts -Wshadow -Wpointer-arith -Wmissing-prototypes -Wwrite-strings -D_XOPEN_SOURCE=500 -D_BSD_SOURCE -O2 -O2 -g -m32 -march=i486 -fmessage-length=0 -D_FORTIFY_SOURCE=2 conftest.c >&5
/tmp/ccObV72l.o: In function `main':
/usr/src/packages/BUILD/kcometen3-1.1/conftest.c:65: undefined reference to `dlopen'
/tmp/ccObV72l.o:(.data+0x0): undefined reference to `dlopen'
collect2: ld returned 1 exit status
configure:10586: $? = 1
configure: failed program was:
| /* confdefs.h. */
|
| #define PACKAGE_NAME ""
| #define PACKAGE_TARNAME ""
| #define PACKAGE_VERSION ""
| #define PACKAGE_STRING ""
| #define PACKAGE_BUGREPORT ""
| #define PACKAGE "kcometen3"
| #define VERSION "1.1"
| #ifdef __cplusplus
| extern "C" void exit (int) throw ();
| #endif
| #define KDELIBSUFF ""
| #define STDC_HEADERS 1
| #define HAVE_SYS_TYPES_H 1
| #define HAVE_SYS_STAT_H 1
| #define HAVE_STDLIB_H 1
| #define HAVE_STRING_H 1
| #define HAVE_MEMORY_H 1
| #define HAVE_STRINGS_H 1
| #define HAVE_INTTYPES_H 1
| #define HAVE_STDINT_H 1
| #define HAVE_UNISTD_H 1
| #define HAVE_DLFCN_H 1
| /* end confdefs.h. */
| /* Define dlopen to an innocuous variant, in case <limits.h> declares dlopen.
| For example, HP-UX 11i <limits.h> declares gettimeofday. */
| #define dlopen innocuous_dlopen
|
| /* System header to define __stub macros and hopefully few prototypes,
| which can conflict with char dlopen (); below.
| Prefer <limits.h> to <assert.h> if __STDC__ is defined, since
| <limits.h> exists even on freestanding compilers. */
|
| #ifdef __STDC__
| # include <limits.h>
| #else
| # include <assert.h>
| #endif
|
| #undef dlopen
|
| /* Override any gcc2 internal prototype to avoid an error. */
| #ifdef __cplusplus
| extern "C"
| {
| #endif
| /* We use char because int might match the return type of a gcc2
| builtin and then its argument prototype would still apply. */
| char dlopen ();
| /* The GNU C library defines this for functions which it implements
| to always fail with ENOSYS. Some functions are actually named
| something starting with __ and the normal name is an alias. */
| #if defined (__stub_dlopen) || defined (__stub___dlopen)
| choke me
| #else
| char (*f) () = dlopen;
| #endif
| #ifdef __cplusplus
| }
| #endif
|
| int
| main ()
| {
| return f != dlopen;
| ;
| return 0;
| }
configure:10610: result: no
configure:10615: checking for dlopen in -ldl
configure:10645: gcc -o conftest -ansi -W -Wall -Wchar-subscripts -Wshadow -Wpointer-arith -Wmissing-prototypes -Wwrite-strings -D_XOPEN_SOURCE=500 -D_BSD_SOURCE -O2 -O2 -g -m32 -march=i486 -fmessage-length=0 -D_FORTIFY_SOURCE=2 conftest.c -ldl >&5
configure:10651: $? = 0
configure:10654: test -z || test ! -s conftest.err
configure:10657: $? = 0
configure:10660: test -s conftest
configure:10663: $? = 0
configure:10676: result: yes
configure:10849: checking whether a program can dlopen itself
configure:10921: gcc -o conftest -ansi -W -Wall -Wchar-subscripts -Wshadow -Wpointer-arith -Wmissing-prototypes -Wwrite-strings -D_XOPEN_SOURCE=500 -D_BSD_SOURCE -O2 -O2 -g -m32 -march=i486 -fmessage-length=0 -D_FORTIFY_SOURCE=2 -DHAVE_DLFCN_H -Wl,--export-dynamic conftest.c -ldl >&5
configure:10904: warning: no previous prototype for 'fnord'
configure: In function 'fnord':
configure:10904: warning: unused variable 'i'
configure: In function 'main':
configure:10917: warning: implicit declaration of function 'exit'
configure:10917: warning: incompatible implicit declaration of built-in function 'exit'
configure:10924: $? = 0
configure:10942: result: yes
configure:10947: checking whether a statically linked program can dlopen itself
configure:11019: gcc -o conftest -ansi -W -Wall -Wchar-subscripts -Wshadow -Wpointer-arith -Wmissing-prototypes -Wwrite-strings -D_XOPEN_SOURCE=500 -D_BSD_SOURCE -O2 -O2 -g -m32 -march=i486 -fmessage-length=0 -D_FORTIFY_SOURCE=2 -DHAVE_DLFCN_H -Wl,--export-dynamic conftest.c -ldl >&5
configure:11002: warning: no previous prototype for 'fnord'
configure: In function 'fnord':
configure:11002: warning: unused variable 'i'
configure: In function 'main':
configure:11015: warning: implicit declaration of function 'exit'
configure:11015: warning: incompatible implicit declaration of built-in function 'exit'
configure:11022: $? = 0
configure:11040: result: yes
configure:11063: checking if libtool supports shared libraries
configure:11065: result: yes
configure:11068: checking whether to build shared libraries
configure:11115: result: yes
configure:11118: checking whether to build static libraries
configure:11122: result: no
configure:11213: creating libtool
configure:11757: checking for ld used by g++
configure:11824: result: /usr/x86_64-suse-linux/bin/ld -m elf_i386
configure:11833: checking if the linker (/usr/x86_64-suse-linux/bin/ld -m elf_i386) is GNU ld
configure:11848: result: yes
configure:11899: checking whether the g++ linker (/usr/x86_64-suse-linux/bin/ld -m elf_i386) supports shared libraries
configure:12700: result: yes
configure:12718: g++ -c -Wall -W -Wpointer-arith -Wwrite-strings -ansi -D_XOPEN_SOURCE=500 -D_BSD_SOURCE -Wcast-align -Wconversion -Wchar-subscripts -O2 -O2 -g -m32 -march=i486 -fmessage-length=0 -D_FORTIFY_SOURCE=2 conftest.cc >&5
configure:12721: $? = 0
configure:12817: checking for g++ option to produce PIC
configure:13069: result: -fPIC
configure:13077: checking if g++ PIC flag -fPIC works
configure:13095: g++ -c -Wall -W -Wpointer-arith -Wwrite-strings -ansi -D_XOPEN_SOURCE=500 -D_BSD_SOURCE -Wcast-align -Wconversion -Wchar-subscripts -O2 -O2 -g -m32 -march=i486 -fmessage-length=0 -D_FORTIFY_SOURCE=2 -fPIC -DPIC conftest.cc >&5
configure:13099: $? = 0
configure:13110: result: yes
configure:13134: checking if g++ supports -c -o file.o
configure:13162: g++ -c -Wall -W -Wpointer-arith -Wwrite-strings -ansi -D_XOPEN_SOURCE=500 -D_BSD_SOURCE -Wcast-align -Wconversion -Wchar-subscripts -O2 -O2 -g -m32 -march=i486 -fmessage-length=0 -D_FORTIFY_SOURCE=2 -o out/conftest2.o conftest.cc >&5
configure:13166: $? = 0
configure:13183: result: yes
configure:13209: checking whether the g++ linker (/usr/x86_64-suse-linux/bin/ld -m elf_i386) supports shared libraries
configure:13234: result: yes
configure:13305: checking dynamic linker characteristics
configure:13823: result: GNU/Linux ld.so
configure:13827: checking how to hardcode library paths into programs
configure:13852: result: immediate
configure:13866: checking whether stripping libraries is possible
configure:13871: result: yes
configure:13996: checking for shl_load
configure:14083: result: no
configure:14088: checking for shl_load in -ldld
configure:14149: result: no
configure:14154: checking for dlopen
configure:14241: result: no
configure:14246: checking for dlopen in -ldl
configure:14307: result: yes
configure:14480: checking whether a program can dlopen itself
configure:14573: result: yes
configure:14578: checking whether a statically linked program can dlopen itself
configure:14671: result: yes
configure:15167: checking if libtool supports shared libraries
configure:15169: result: yes
configure:15172: checking whether to build shared libraries
configure:15190: result: yes
configure:15193: checking whether to build static libraries
configure:15197: result: no
configure:15209: checking for gfortran option to produce PIC
configure:15386: result: -fPIC
configure:15394: checking if gfortran PIC flag -fPIC works
configure:15412: gfortran -c -g -O2 -fPIC conftest.f >&5
configure:15416: $? = 0
configure:15427: result: yes
configure:15451: checking if gfortran supports -c -o file.o
configure:15479: gfortran -c -g -O2 -o out/conftest2.o conftest.f >&5
configure:15483: $? = 0
configure:15500: result: yes
configure:15526: checking whether the gfortran linker (/usr/x86_64-suse-linux/bin/ld -m elf_i386) supports shared libraries
configure:16305: result: yes
configure:16376: checking dynamic linker characteristics
configure:16894: result: GNU/Linux ld.so
configure:16898: checking how to hardcode library paths into programs
configure:16923: result: immediate
configure:16937: checking whether stripping libraries is possible
configure:16942: result: yes
configure:20970: checking for msgfmt
configure:20997: result: /usr/bin/msgfmt
configure:21006: checking for gmsgfmt
configure:21037: result: /usr/bin/msgfmt
configure:21056: checking for xgettext
configure:21083: result: :
configure:21196: checking if C++ programs can be compiled
configure:21225: g++ -c -Wall -W -Wpointer-arith -Wwrite-strings -ansi -D_XOPEN_SOURCE=500 -D_BSD_SOURCE -Wcast-align -Wconversion -Wchar-subscripts -O2 -O2 -g -m32 -march=i486 -fmessage-length=0 -D_FORTIFY_SOURCE=2 conftest.cc >&5
configure:21231: $? = 0
configure:21234: test -z || test ! -s conftest.err
configure:21237: $? = 0
configure:21240: test -s conftest.o
configure:21243: $? = 0
configure:21257: result: yes
configure:21287: checking for strlcat
configure:21335: g++ -c -Wall -W -Wpointer-arith -Wwrite-strings -ansi -D_XOPEN_SOURCE=500 -D_BSD_SOURCE -Wcast-align -Wconversion -Wchar-subscripts -O2 -O2 -g -m32 -march=i486 -fmessage-length=0 -D_FORTIFY_SOURCE=2 -pedantic-errors conftest.cc >&5
conftest.cc: In function 'int main()':
conftest.cc:38: error: 'strlcat' was not declared in this scope
configure:21341: $? = 1
configure: failed program was:
| /* confdefs.h. */
|
| #define PACKAGE_NAME ""
| #define PACKAGE_TARNAME ""
| #define PACKAGE_VERSION ""
| #define PACKAGE_STRING ""
| #define PACKAGE_BUGREPORT ""
| #define PACKAGE "kcometen3"
| #define VERSION "1.1"
| #ifdef __cplusplus
| extern "C" void exit (int) throw ();
| #endif
| #define KDELIBSUFF ""
| #define STDC_HEADERS 1
| #define HAVE_SYS_TYPES_H 1
| #define HAVE_SYS_STAT_H 1
| #define HAVE_STDLIB_H 1
| #define HAVE_STRING_H 1
| #define HAVE_MEMORY_H 1
| #define HAVE_STRINGS_H 1
| #define HAVE_INTTYPES_H 1
| #define HAVE_STDINT_H 1
| #define HAVE_UNISTD_H 1
| #define HAVE_DLFCN_H 1
| #define HAVE_SGI_STL 1
| /* end confdefs.h. */
|
|
| #include <string.h>
|
|
| int
| main ()
| {
|
| char buf[20];
| buf[0]='\0';
| strlcat(buf, "KDE function test", sizeof(buf));
|
|
| ;
| return 0;
| }
configure:21375: result: no
configure:21378: checking if strlcat needs custom prototype
configure:21481: result: yes - in libkdefakes
configure:21506: checking for strlcpy
configure:21553: g++ -c -Wall -W -Wpointer-arith -Wwrite-strings -ansi -D_XOPEN_SOURCE=500 -D_BSD_SOURCE -Wcast-align -Wconversion -Wchar-subscripts -O2 -O2 -g -m32 -march=i486 -fmessage-length=0 -D_FORTIFY_SOURCE=2 -pedantic-errors conftest.cc >&5
conftest.cc: In function 'int main()':
conftest.cc:37: error: 'strlcpy' was not declared in this scope
configure:21559: $? = 1
configure: failed program was:
| /* confdefs.h. */
|
| #define PACKAGE_NAME ""
| #define PACKAGE_TARNAME ""
| #define PACKAGE_VERSION ""
| #define PACKAGE_STRING ""
| #define PACKAGE_BUGREPORT ""
| #define PACKAGE "kcometen3"
| #define VERSION "1.1"
| #ifdef __cplusplus
| extern "C" void exit (int) throw ();
| #endif
| #define KDELIBSUFF ""
| #define STDC_HEADERS 1
| #define HAVE_SYS_TYPES_H 1
| #define HAVE_SYS_STAT_H 1
| #define HAVE_STDLIB_H 1
| #define HAVE_STRING_H 1
| #define HAVE_MEMORY_H 1
| #define HAVE_STRINGS_H 1
| #define HAVE_INTTYPES_H 1
| #define HAVE_STDINT_H 1
| #define HAVE_UNISTD_H 1
| #define HAVE_DLFCN_H 1
| #define HAVE_SGI_STL 1
| /* end confdefs.h. */
|
|
| #include <string.h>
|
|
| int
| main ()
| {
|
| char buf[20];
| strlcpy(buf, "KDE function test", sizeof(buf));
|
|
| ;
| return 0;
| }
configure:21593: result: no
configure:21596: checking if strlcpy needs custom prototype
configure:21698: result: yes - in libkdefakes
configure:21722: checking for main in -lutil
configure:21746: gcc -o conftest -ansi -W -Wall -Wchar-subscripts -Wshadow -Wpointer-arith -Wmissing-prototypes -Wwrite-strings -D_XOPEN_SOURCE=500 -D_BSD_SOURCE -O2 -O2 -g -m32 -march=i486 -fmessage-length=0 -D_FORTIFY_SOURCE=2 conftest.c -lutil >&5
configure:21752: $? = 0
configure:21755: test -z || test ! -s conftest.err
configure:21758: $? = 0
configure:21761: test -s conftest
configure:21764: $? = 0
configure:21777: result: yes
configure:21783: checking for main in -lcompat
configure:21807: gcc -o conftest -ansi -W -Wall -Wchar-subscripts -Wshadow -Wpointer-arith -Wmissing-prototypes -Wwrite-strings -D_XOPEN_SOURCE=500 -D_BSD_SOURCE -O2 -O2 -g -m32 -march=i486 -fmessage-length=0 -D_FORTIFY_SOURCE=2 conftest.c -lcompat >&5
/usr/lib64/gcc/x86_64-suse-linux/4.2.3/../../../../x86_64-suse-linux/bin/ld: cannot find -lcompat
collect2: ld returned 1 exit status
configure:21813: $? = 1
configure: failed program was:
| /* confdefs.h. */
|
| #define PACKAGE_NAME ""
| #define PACKAGE_TARNAME ""
| #define PACKAGE_VERSION ""
| #define PACKAGE_STRING ""
| #define PACKAGE_BUGREPORT ""
| #define PACKAGE "kcometen3"
| #define VERSION "1.1"
| #ifdef __cplusplus
| extern "C" void exit (int) throw ();
| #endif
| #define KDELIBSUFF ""
| #define STDC_HEADERS 1
| #define HAVE_SYS_TYPES_H 1
| #define HAVE_SYS_STAT_H 1
| #define HAVE_STDLIB_H 1
| #define HAVE_STRING_H 1
| #define HAVE_MEMORY_H 1
| #define HAVE_STRINGS_H 1
| #define HAVE_INTTYPES_H 1
| #define HAVE_STDINT_H 1
| #define HAVE_UNISTD_H 1
| #define HAVE_DLFCN_H 1
| #define HAVE_SGI_STL 1
| /* end confdefs.h. */
|
|
| int
| main ()
| {
| main ();
| ;
| return 0;
| }
configure:21838: result: no
configure:21845: checking for crypt in -lcrypt
configure:21875: gcc -o conftest -ansi -W -Wall -Wchar-subscripts -Wshadow -Wpointer-arith -Wmissing-prototypes -Wwrite-strings -D_XOPEN_SOURCE=500 -D_BSD_SOURCE -O2 -O2 -g -m32 -march=i486 -fmessage-length=0 -D_FORTIFY_SOURCE=2 conftest.c -lcrypt >&5
configure:21881: $? = 0
configure:21884: test -z || test ! -s conftest.err
configure:21887: $? = 0
configure:21890: test -s conftest
configure:21893: $? = 0
configure:21906: result: yes
configure:21999: checking for socklen_t
configure:22038: g++ -c -Wall -W -Wpointer-arith -Wwrite-strings -ansi -D_XOPEN_SOURCE=500 -D_BSD_SOURCE -Wcast-align -Wconversion -Wchar-subscripts -O2 -O2 -g -m32 -march=i486 -fmessage-length=0 -D_FORTIFY_SOURCE=2 conftest.cc >&5
configure:22044: $? = 0
configure:22047: test -z || test ! -s conftest.err
configure:22050: $? = 0
configure:22053: test -s conftest.o
configure:22056: $? = 0
configure:22127: result: socklen_t
configure:22143: checking for dnet_ntoa in -ldnet
configure:22173: gcc -o conftest -ansi -W -Wall -Wchar-subscripts -Wshadow -Wpointer-arith -Wmissing-prototypes -Wwrite-strings -D_XOPEN_SOURCE=500 -D_BSD_SOURCE -O2 -O2 -g -m32 -march=i486 -fmessage-length=0 -D_FORTIFY_SOURCE=2 conftest.c -ldnet >&5
/usr/lib64/gcc/x86_64-suse-linux/4.2.3/../../../../x86_64-suse-linux/bin/ld: cannot find -ldnet
collect2: ld returned 1 exit status
configure:22179: $? = 1
configure: failed program was:
| /* confdefs.h. */
|
| #define PACKAGE_NAME ""
| #define PACKAGE_TARNAME ""
| #define PACKAGE_VERSION ""
| #define PACKAGE_STRING ""
| #define PACKAGE_BUGREPORT ""
| #define PACKAGE "kcometen3"
| #define VERSION "1.1"
| #ifdef __cplusplus
| extern "C" void exit (int) throw ();
| #endif
| #define KDELIBSUFF ""
| #define STDC_HEADERS 1
| #define HAVE_SYS_TYPES_H 1
| #define HAVE_SYS_STAT_H 1
| #define HAVE_STDLIB_H 1
| #define HAVE_STRING_H 1
| #define HAVE_MEMORY_H 1
| #define HAVE_STRINGS_H 1
| #define HAVE_INTTYPES_H 1
| #define HAVE_STDINT_H 1
| #define HAVE_UNISTD_H 1
| #define HAVE_DLFCN_H 1
| #define HAVE_SGI_STL 1
| #define HAVE_CRYPT 1
| #define ksize_t socklen_t
| /* end confdefs.h. */
|
| /* Override any gcc2 internal prototype to avoid an error. */
| #ifdef __cplusplus
| extern "C"
| #endif
| /* We use char because int might match the return type of a gcc2
| builtin and then its argument prototype would still apply. */
| char dnet_ntoa ();
| int
| main ()
| {
| dnet_ntoa ();
| ;
| return 0;
| }
configure:22204: result: no
configure:22211: checking for dnet_ntoa in -ldnet_stub
configure:22241: gcc -o conftest -ansi -W -Wall -Wchar-subscripts -Wshadow -Wpointer-arith -Wmissing-prototypes -Wwrite-strings -D_XOPEN_SOURCE=500 -D_BSD_SOURCE -O2 -O2 -g -m32 -march=i486 -fmessage-length=0 -D_FORTIFY_SOURCE=2 conftest.c -ldnet_stub >&5
/usr/lib64/gcc/x86_64-suse-linux/4.2.3/../../../../x86_64-suse-linux/bin/ld: cannot find -ldnet_stub
collect2: ld returned 1 exit status
configure:22247: $? = 1
configure: failed program was:
| /* confdefs.h. */
|
| #define PACKAGE_NAME ""
| #define PACKAGE_TARNAME ""
| #define PACKAGE_VERSION ""
| #define PACKAGE_STRING ""
| #define PACKAGE_BUGREPORT ""
| #define PACKAGE "kcometen3"
| #define VERSION "1.1"
| #ifdef __cplusplus
| extern "C" void exit (int) throw ();
| #endif
| #define KDELIBSUFF ""
| #define STDC_HEADERS 1
| #define HAVE_SYS_TYPES_H 1
| #define HAVE_SYS_STAT_H 1
| #define HAVE_STDLIB_H 1
| #define HAVE_STRING_H 1
| #define HAVE_MEMORY_H 1
| #define HAVE_STRINGS_H 1
| #define HAVE_INTTYPES_H 1
| #define HAVE_STDINT_H 1
| #define HAVE_UNISTD_H 1
| #define HAVE_DLFCN_H 1
| #define HAVE_SGI_STL 1
| #define HAVE_CRYPT 1
| #define ksize_t socklen_t
| /* end confdefs.h. */
|
| /* Override any gcc2 internal prototype to avoid an error. */
| #ifdef __cplusplus
| extern "C"
| #endif
| /* We use char because int might match the return type of a gcc2
| builtin and then its argument prototype would still apply. */
| char dnet_ntoa ();
| int
| main ()
| {
| dnet_ntoa ();
| ;
| return 0;
| }
configure:22272: result: no
configure:22279: checking for inet_ntoa
configure:22336: gcc -o conftest -ansi -W -Wall -Wchar-subscripts -Wshadow -Wpointer-arith -Wmissing-prototypes -Wwrite-strings -D_XOPEN_SOURCE=500 -D_BSD_SOURCE -O2 -O2 -g -m32 -march=i486 -fmessage-length=0 -D_FORTIFY_SOURCE=2 conftest.c >&5
configure:22342: $? = 0
configure:22345: test -z || test ! -s conftest.err
configure:22348: $? = 0
configure:22351: test -s conftest
configure:22354: $? = 0
configure:22366: result: yes
configure:22438: checking for connect
configure:22495: gcc -o conftest -ansi -W -Wall -Wchar-subscripts -Wshadow -Wpointer-arith -Wmissing-prototypes -Wwrite-strings -D_XOPEN_SOURCE=500 -D_BSD_SOURCE -O2 -O2 -g -m32 -march=i486 -fmessage-length=0 -D_FORTIFY_SOURCE=2 conftest.c >&5
configure:22501: $? = 0
configure:22504: test -z || test ! -s conftest.err
configure:22507: $? = 0
configure:22510: test -s conftest
configure:22513: $? = 0
configure:22525: result: yes
configure:22598: checking for remove
configure:22655: gcc -o conftest -ansi -W -Wall -Wchar-subscripts -Wshadow -Wpointer-arith -Wmissing-prototypes -Wwrite-strings -D_XOPEN_SOURCE=500 -D_BSD_SOURCE -O2 -O2 -g -m32 -march=i486 -fmessage-length=0 -D_FORTIFY_SOURCE=2 conftest.c >&5
configure:22661: $? = 0
configure:22664: test -z || test ! -s conftest.err
configure:22667: $? = 0
configure:22670: test -s conftest
configure:22673: $? = 0
configure:22685: result: yes
configure:22759: checking for shmat
configure:22816: gcc -o conftest -ansi -W -Wall -Wchar-subscripts -Wshadow -Wpointer-arith -Wmissing-prototypes -Wwrite-strings -D_XOPEN_SOURCE=500 -D_BSD_SOURCE -O2 -O2 -g -m32 -march=i486 -fmessage-length=0 -D_FORTIFY_SOURCE=2 conftest.c >&5
configure:22822: $? = 0
configure:22825: test -z || test ! -s conftest.err
configure:22828: $? = 0
configure:22831: test -s conftest
configure:22834: $? = 0
configure:22846: result: yes
configure:22928: checking for sys/types.h
configure:22933: result: yes
configure:22928: checking for stdint.h
configure:22933: result: yes
configure:23074: checking for poll in -lpoll
configure:23104: gcc -o conftest -ansi -W -Wall -Wchar-subscripts -Wshadow -Wpointer-arith -Wmissing-prototypes -Wwrite-strings -D_XOPEN_SOURCE=500 -D_BSD_SOURCE -O2 -O2 -g -m32 -march=i486 -fmessage-length=0 -D_FORTIFY_SOURCE=2 conftest.c -lpoll >&5
/usr/lib64/gcc/x86_64-suse-linux/4.2.3/../../../../x86_64-suse-linux/bin/ld: cannot find -lpoll
collect2: ld returned 1 exit status
configure:23110: $? = 1
configure: failed program was:
| /* confdefs.h. */
|
| #define PACKAGE_NAME ""
| #define PACKAGE_TARNAME ""
| #define PACKAGE_VERSION ""
| #define PACKAGE_STRING ""
| #define PACKAGE_BUGREPORT ""
| #define PACKAGE "kcometen3"
| #define VERSION "1.1"
| #ifdef __cplusplus
| extern "C" void exit (int) throw ();
| #endif
| #define KDELIBSUFF ""
| #define ST

Be free, use Linux! ma meglio se openSUSE...

Ritratto di Utino
Utino
(Monster)
Offline
Monster
Iscritto: 14/10/2006
Messaggi: 212

ops non ci sta tutto il config.log, sotto c'è il resto:

| #define STDC_HEADERS 1
| #define HAVE_SYS_TYPES_H 1
| #define HAVE_SYS_STAT_H 1
| #define HAVE_STDLIB_H 1
| #define HAVE_STRING_H 1
| #define HAVE_MEMORY_H 1
| #define HAVE_STRINGS_H 1
| #define HAVE_INTTYPES_H 1
| #define HAVE_STDINT_H 1
| #define HAVE_UNISTD_H 1
| #define HAVE_DLFCN_H 1
| #define HAVE_SGI_STL 1
| #define HAVE_CRYPT 1
| #define ksize_t socklen_t
| #define HAVE_SYS_TYPES_H 1
| #define HAVE_STDINT_H 1
| #define HAVE_RES_INIT 1
| #define HAVE_RES_INIT 1
| #define SIZEOF_INT 4
| #define SIZEOF_SHORT 2
| #define SIZEOF_LONG 4
| #define SIZEOF_CHAR_P 4
| #define SIZEOF_SIZE_T 4
| #define SIZEOF_UNSIGNED_LONG 4
| #define HAVE_VSNPRINTF 1
| #define HAVE_SNPRINTF 1
| /* end confdefs.h. */
|
| #include <stdio.h>
| #ifdef STDC_HEADERS
| # include <stdlib.h>
| #endif
|
| int
| main ()
| {
|
| printf("hello Xext\n");
|
| ;
| return 0;
| }
configure:27086: result: no
configure:27092: error: We need a working libXext to proceed. Since configure
can't find it itself, we stop here assuming that make wouldn't find
them either.

## ---------------- ##
## Cache variables. ##
## ---------------- ##

ac_cv_build=x86_64-unknown-linux-gnu
ac_cv_build_alias=x86_64-unknown-linux-gnu
ac_cv_c_compiler_gnu=yes
ac_cv_cxx_compiler_gnu=yes
ac_cv_env_CC_set=
ac_cv_env_CC_value=
ac_cv_env_CFLAGS_set=set
ac_cv_env_CFLAGS_value='-O2 -g -m32 -march=i486 -fmessage-length=0 -D_FORTIFY_SOURCE=2'
ac_cv_env_CPPFLAGS_set=
ac_cv_env_CPPFLAGS_value=
ac_cv_env_CPP_set=
ac_cv_env_CPP_value=
ac_cv_env_CXXCPP_set=
ac_cv_env_CXXCPP_value=
ac_cv_env_CXXFLAGS_set=set
ac_cv_env_CXXFLAGS_value='-O2 -g -m32 -march=i486 -fmessage-length=0 -D_FORTIFY_SOURCE=2'
ac_cv_env_CXX_set=
ac_cv_env_CXX_value=
ac_cv_env_F77_set=
ac_cv_env_F77_value=
ac_cv_env_FFLAGS_set=
ac_cv_env_FFLAGS_value=
ac_cv_env_LDFLAGS_set=
ac_cv_env_LDFLAGS_value=
ac_cv_env_build_alias_set=
ac_cv_env_build_alias_value=
ac_cv_env_host_alias_set=
ac_cv_env_host_alias_value=
ac_cv_env_target_alias_set=
ac_cv_env_target_alias_value=
ac_cv_exeext=
ac_cv_f77_compiler_gnu=yes
ac_cv_func__NSGetEnviron=no
ac_cv_func_connect=yes
ac_cv_func_dlopen=no
ac_cv_func_inet_ntoa=yes
ac_cv_func_remove=yes
ac_cv_func_shl_load=no
ac_cv_func_shmat=yes
ac_cv_func_snprintf=yes
ac_cv_func_vsnprintf=yes
ac_cv_have_dlfcn=yes
ac_cv_header_CoreAudio_CoreAudio_h=no
ac_cv_header_crt_externs_h=no
ac_cv_header_dlfcn_h=yes
ac_cv_header_inttypes_h=yes
ac_cv_header_memory_h=yes
ac_cv_header_stdc=yes
ac_cv_header_stdint_h=yes
ac_cv_header_stdlib_h=yes
ac_cv_header_string_h=yes
ac_cv_header_strings_h=yes
ac_cv_header_sys_stat_h=yes
ac_cv_header_sys_types_h=yes
ac_cv_header_unistd_h=yes
ac_cv_host=x86_64-unknown-linux-gnu
ac_cv_host_alias=x86_64-unknown-linux-gnu
ac_cv_lib_ICE_IceConnectionNumber=no
ac_cv_lib_compat_main=no
ac_cv_lib_crypt_crypt=yes
ac_cv_lib_dl_dlopen=yes
ac_cv_lib_dld_shl_load=no
ac_cv_lib_dld_shl_unload=no
ac_cv_lib_dnet_dnet_ntoa=no
ac_cv_lib_dnet_stub_dnet_ntoa=no
ac_cv_lib_poll_poll=no
ac_cv_lib_ucb_killpg=no
ac_cv_lib_util_main=yes
ac_cv_objext=o
ac_cv_path_GMSGFMT=/usr/bin/msgfmt
ac_cv_path_MSGFMT=/usr/bin/msgfmt
ac_cv_path_XGETTEXT=:
ac_cv_path_install='/usr/bin/install -c'
ac_cv_prog_AWK=gawk
ac_cv_prog_CPP='gcc -E'
ac_cv_prog_CXXCPP='g++ -E'
ac_cv_prog_ac_ct_AR=ar
ac_cv_prog_ac_ct_CC=gcc
ac_cv_prog_ac_ct_CXX=g++
ac_cv_prog_ac_ct_F77=gfortran
ac_cv_prog_ac_ct_RANLIB=ranlib
ac_cv_prog_ac_ct_STRIP=strip
ac_cv_prog_cc_g=yes
ac_cv_prog_cc_stdc=
ac_cv_prog_cxx_g=yes
ac_cv_prog_egrep='grep -E'
ac_cv_prog_f77_g=yes
ac_cv_prog_make_make_set=yes
ac_cv_sizeof_char_p=4
ac_cv_sizeof_int=4
ac_cv_sizeof_long=4
ac_cv_sizeof_short=2
ac_cv_sizeof_size_t=4
ac_cv_sizeof_unsigned_long=4
ac_cv_socklen_t=socklen_t
ac_cv_target=x86_64-unknown-linux-gnu
ac_cv_target_alias=x86_64-unknown-linux-gnu
ac_cv_type_char_p=yes
ac_cv_type_int=yes
ac_cv_type_long=yes
ac_cv_type_short=yes
ac_cv_type_size_t=yes
ac_cv_type_unsigned_long=yes
am_cv_CC_dependencies_compiler_type=gcc3
am_cv_CXX_dependencies_compiler_type=gcc3
kde_cv_func_strlcat=no
kde_cv_func_strlcpy=no
kde_cv_have_libXext=no
kde_cv_have_x='have_x=yes kde_x_includes=. kde_x_libraries=/usr/lib64'
kde_cv_proto_strlcat='yes - in libkdefakes'
kde_cv_proto_strlcpy='yes - in libkdefakes'
kde_cv_stl_works=yes
lt_cv_deplibs_check_method=pass_all
lt_cv_dlopen=dlopen
lt_cv_dlopen_libs=-ldl
lt_cv_dlopen_self=yes
lt_cv_dlopen_self_static=yes
lt_cv_file_magic_cmd='$MAGIC_CMD'
lt_cv_file_magic_test_file='/lib/libc.so.6 /lib/libc-2.6.1.so'
lt_cv_ld_reload_flag=-r
lt_cv_objdir=.libs
lt_cv_path_LD=/usr/x86_64-suse-linux/bin/ld
lt_cv_path_LDCXX='/usr/x86_64-suse-linux/bin/ld -m elf_i386'
lt_cv_path_NM='/usr/bin/nm -B'
lt_cv_path_SED=/bin/sed
lt_cv_prog_compiler_c_o=yes
lt_cv_prog_compiler_c_o_CXX=yes
lt_cv_prog_compiler_c_o_F77=yes
lt_cv_prog_compiler_rtti_exceptions=no
lt_cv_prog_gnu_ld=yes
lt_cv_prog_gnu_ldcxx=yes
lt_cv_sys_global_symbol_pipe='sed -n -e '\''s/^.*[ ]\([ABCDGISTW][ABCDGISTW]*\)[ ][ ]*\(\)\([_A-Za-z][_A-Za-z0-9]*\)$/\1 \2\3 \3/p'\'''
lt_cv_sys_global_symbol_to_c_name_address='sed -n -e '\''s/^: \([^ ]*\) $/ {\"\1\", (lt_ptr) 0},/p'\'' -e '\''s/^[BCDEGRST] \([^ ]*\) \([^ ]*\)$/ {"\2", (lt_ptr) \&\2},/p'\'''
lt_cv_sys_global_symbol_to_cdecl='sed -n -e '\''s/^. .* \(.*\)$/extern int \1;/p'\'''
lt_cv_sys_max_cmd_len=32768
lt_lt_cv_prog_compiler_c_o='"yes"'
lt_lt_cv_prog_compiler_c_o_CXX='"yes"'
lt_lt_cv_prog_compiler_c_o_F77='"yes"'
lt_lt_cv_sys_global_symbol_pipe='"sed -n -e '\''s/^.*[ ]\\([ABCDGISTW][ABCDGISTW]*\\)[ ][ ]*\\(\\)\\([_A-Za-z][_A-Za-z0-9]*\\)\$/\\1 \\2\\3 \\3/p'\''"'
lt_lt_cv_sys_global_symbol_to_c_name_address='"sed -n -e '\''s/^: \\([^ ]*\\) \$/ {\\\"\\1\\\", (lt_ptr) 0},/p'\'' -e '\''s/^[BCDEGRST] \\([^ ]*\\) \\([^ ]*\\)\$/ {\"\\2\", (lt_ptr) \\&\\2},/p'\''"'
lt_lt_cv_sys_global_symbol_to_cdecl='"sed -n -e '\''s/^. .* \\(.*\\)\$/extern int \\1;/p'\''"'

## ----------------- ##
## Output variables. ##
## ----------------- ##

ACLOCAL='${SHELL} /usr/src/packages/BUILD/kcometen3-1.1/admin/missing --run aclocal-1.7'
AMDEPBACKSLASH='\'
AMDEP_FALSE='#'
AMDEP_TRUE=''
AMTAR='${SHELL} /usr/src/packages/BUILD/kcometen3-1.1/admin/missing --run tar'
AR='ar'
ARTSCCONFIG=''
AUTOCONF='$(SHELL) $(top_srcdir)/admin/cvs.sh configure || touch configure'
AUTODIRS=''
AUTOHEADER='${SHELL} /usr/src/packages/BUILD/kcometen3-1.1/admin/missing --run autoheader'
AUTOMAKE='${SHELL} /usr/src/packages/BUILD/kcometen3-1.1/admin/missing --run automake-1.7'
AWK='gawk'
CC='gcc'
CCDEPMODE='depmode=gcc3'
CFLAGS='-ansi -W -Wall -Wchar-subscripts -Wshadow -Wpointer-arith -Wmissing-prototypes -Wwrite-strings -D_XOPEN_SOURCE=500 -D_BSD_SOURCE -O2 -O2 -g -m32 -march=i486 -fmessage-length=0 -D_FORTIFY_SOURCE=2'
CONF_FILES=' $(top_srcdir)/./admin/configure.in.min $(top_srcdir)/configure.in.in'
CPP='gcc -E'
CPPFLAGS=''
CXX='g++'
CXXCPP='g++ -E'
CXXDEPMODE='depmode=gcc3'
CXXFLAGS='-Wall -W -Wpointer-arith -Wwrite-strings -ansi -D_XOPEN_SOURCE=500 -D_BSD_SOURCE -Wcast-align -Wconversion -Wchar-subscripts -O2 -O2 -g -m32 -march=i486 -fmessage-length=0 -D_FORTIFY_SOURCE=2'
CYGPATH_W='echo'
DCOPIDL2CPP=''
DCOPIDL=''
DCOPIDLNG=''
DCOP_DEPENDENCIES=''
DEFS=''
DEPDIR='.deps'
ECHO='echo'
ECHO_C=''
ECHO_N='-n'
ECHO_T=''
EGREP='grep -E'
EXEEXT=''
F77='gfortran'
FFLAGS='-g -O2'
FRAMEWORK_COREAUDIO=''
GMSGFMT='/usr/bin/msgfmt'
INSTALL_DATA='${INSTALL} -m 644'
INSTALL_PROGRAM='${INSTALL} $(INSTALL_STRIP_FLAG)'
INSTALL_SCRIPT='${INSTALL}'
INSTALL_STRIP_PROGRAM='${SHELL} $(install_sh) -c -s'
KCFG_DEPENDENCIES=''
KCONFIG_COMPILER=''
KDECONFIG=''
KDE_EXTRA_RPATH=''
KDE_INCLUDES=''
KDE_LDFLAGS=''
KDE_MT_LDFLAGS=''
KDE_MT_LIBS=''
KDE_NO_UNDEFINED=''
KDE_PLUGIN='-avoid-version -module -no-undefined $(KDE_NO_UNDEFINED) $(KDE_RPATH) $(KDE_MT_LDFLAGS)'
KDE_RPATH=''
KDE_USE_CLOSURE_FALSE=''
KDE_USE_CLOSURE_TRUE='#'
KDE_USE_FINAL_FALSE=''
KDE_USE_FINAL_TRUE='#'
KDE_USE_NMCHECK_FALSE=''
KDE_USE_NMCHECK_TRUE='#'
KDE_XSL_STYLESHEET=''
LDFLAGS=''
LIBCOMPAT=''
LIBCRYPT='-lcrypt'
LIBDL='-ldl'
LIBJPEG=''
LIBOBJS=''
LIBPNG=''
LIBPTHREAD=''
LIBRESOLV='-lresolv'
LIBS=''
LIBSM=''
LIBSOCKET=''
LIBTOOL='$(SHELL) $(top_builddir)/libtool --silent'
LIBUCB=''
LIBUTIL='-lutil'
LIBZ=''
LIB_KAB=''
LIB_KABC=''
LIB_KDECORE=''
LIB_KDEPIM=''
LIB_KDEPRINT=''
LIB_KDEUI=''
LIB_KFILE=''
LIB_KFM=''
LIB_KHTML=''
LIB_KIO=''
LIB_KPARTS=''
LIB_KSPELL=''
LIB_KSYCOCA=''
LIB_KUTILS=''
LIB_POLL=''
LIB_QPE=''
LIB_QT=''
LIB_SMB=''
LIB_X11='-lX11 $(LIBSOCKET)'
LIB_XEXT=''
LIB_XRENDER=''
LN_S='ln -s'
LTLIBOBJS=''
MAKEINFO='${SHELL} /usr/src/packages/BUILD/kcometen3-1.1/admin/missing --run makeinfo'
MCOPIDL=''
MEINPROC=''
MOC=''
MSGFMT='/usr/bin/msgfmt'
NOOPT_CFLAGS='-O0'
NOOPT_CXXFLAGS=''
OBJEXT='o'
PACKAGE='kcometen3'
PACKAGE_BUGREPORT=''
PACKAGE_NAME=''
PACKAGE_STRING=''
PACKAGE_TARNAME=''
PACKAGE_VERSION=''
PATH_SEPARATOR=':'
PERL=''
QTE_NORTTI=''
QT_INCLUDES=''
QT_LDFLAGS=''
RANLIB='ranlib'
SET_MAKE=''
SHELL='/bin/sh'
STRIP='strip'
TOPSUBDIRS=''
UIC=''
UIC_TR=''
USER_INCLUDES=''
USER_LDFLAGS=''
USE_EXCEPTIONS=''
USE_RTTI=''
USE_THREADS=''
VERSION='1.1'
WOVERLOADED_VIRTUAL=''
XGETTEXT=':'
XMLLINT=''
X_EXTRA_LIBS=''
X_INCLUDES='-I.'
X_LDFLAGS='-L/usr/lib64'
X_PRE_LIBS=''
X_RPATH=''
ac_ct_AR='ar'
ac_ct_CC='gcc'
ac_ct_CXX='g++'
ac_ct_F77='gfortran'
ac_ct_RANLIB='ranlib'
ac_ct_STRIP='strip'
all_includes='-I.'
all_libraries='-L/usr/lib64'
am__fastdepCC_FALSE='#'
am__fastdepCC_TRUE=''
am__fastdepCXX_FALSE='#'
am__fastdepCXX_TRUE=''
am__include='include'
am__leading_dot='.'
am__quote=''
bindir='${exec_prefix}/bin'
build='x86_64-unknown-linux-gnu'
build_alias=''
build_cpu='x86_64'
build_os='linux-gnu'
build_vendor='unknown'
datadir='${prefix}/share'
exec_prefix='NONE'
host='x86_64-unknown-linux-gnu'
host_alias=''
host_cpu='x86_64'
host_os='linux-gnu'
host_vendor='unknown'
include_ARTS_FALSE=''
include_ARTS_TRUE=''
includedir='${prefix}/include'
infodir='${prefix}/info'
install_sh='/usr/src/packages/BUILD/kcometen3-1.1/admin/install-sh'
kde_appsdir=''
kde_bindir=''
kde_confdir=''
kde_datadir=''
kde_htmldir=''
kde_icondir=''
kde_includes=''
kde_kcfgdir=''
kde_libraries=''
kde_libs_htmldir=''
kde_libs_prefix=''
kde_locale=''
kde_mimedir=''
kde_moduledir=''
kde_qtver='3'
kde_servicesdir=''
kde_servicetypesdir=''
kde_sounddir=''
kde_styledir=''
kde_templatesdir=''
kde_wallpaperdir=''
kde_widgetdir=''
kdeinitdir=''
libdir='${exec_prefix}/lib'
libexecdir='${exec_prefix}/libexec'
localstatedir='${prefix}/var'
mandir='${prefix}/man'
oldincludedir='/usr/include'
prefix='/opt/kde3'
program_transform_name='s,x,x,'
qt_includes=''
qt_libraries=''
sbindir='${exec_prefix}/sbin'
sharedstatedir='${prefix}/com'
sysconfdir='${prefix}/etc'
target='x86_64-unknown-linux-gnu'
target_alias=''
target_cpu='x86_64'
target_os='linux-gnu'
target_vendor='unknown'
x_includes='.'
x_libraries='/usr/lib64'
xdg_appsdir=''
xdg_directorydir=''
xdg_menudir=''

## ----------- ##
## confdefs.h. ##
## ----------- ##

#define HAVE_CRYPT 1
#define HAVE_DLFCN_H 1
#define HAVE_INTTYPES_H 1
#define HAVE_MEMORY_H 1
#define HAVE_RES_INIT 1
#define HAVE_RES_INIT 1
#define HAVE_SGI_STL 1
#define HAVE_SNPRINTF 1
#define HAVE_STDINT_H 1
#define HAVE_STDINT_H 1
#define HAVE_STDLIB_H 1
#define HAVE_STRINGS_H 1
#define HAVE_STRING_H 1
#define HAVE_SYS_STAT_H 1
#define HAVE_SYS_TYPES_H 1
#define HAVE_SYS_TYPES_H 1
#define HAVE_UNISTD_H 1
#define HAVE_VSNPRINTF 1
#define KDELIBSUFF ""
#define PACKAGE "kcometen3"
#define PACKAGE_BUGREPORT ""
#define PACKAGE_NAME ""
#define PACKAGE_STRING ""
#define PACKAGE_TARNAME ""
#define PACKAGE_VERSION ""
#define SIZEOF_CHAR_P 4
#define SIZEOF_INT 4
#define SIZEOF_LONG 4
#define SIZEOF_SHORT 2
#define SIZEOF_SIZE_T 4
#define SIZEOF_UNSIGNED_LONG 4
#define STDC_HEADERS 1
#define VERSION "1.1"
#define ksize_t socklen_t
#endif
#ifdef __cplusplus
extern "C" void exit (int) throw ();

configure: exit 1

Non è che il problema è XORG che è installato solo a 64bit?
se si sapete dov'è un repo la 10.3? su download.opensuse.org c'è solo per la 10.2!!!

Be free, use Linux! ma meglio se openSUSE...

Ritratto di orion
orion
(Guru)
Offline
Guru
Iscritto: 11/07/2006
Messaggi: 2919

Con yast -> software management, cerca e installa xorg-x11-libXext-devel.

Quando il configure ti dice che manca una libreria, ti conviene sempre cercarla in yast e installare il relativo pacchetto -devel

edit:
Se nel dvd non lo trovi, aggiungi questo repository: http://mirror.switch.ch/ftp/mirror/opensuse/distribution/10.3/repo/oss e vedi che lo trovi (occhio che e` grosso, quindi non preoccuparti se impiega parecchio ad aggiungertelo e, soprattutto, dopo averlo aggiunto disabilitane il refresh)

openSUSE 12.1 on Acer Aspire 1810tz - LXDE ultima versione dal repo x11:/lxde

Ritratto di Utino
Utino
(Monster)
Offline
Monster
Iscritto: 14/10/2006
Messaggi: 212

quella ce l'ho già, ne esiste una a 32 bit? in yast non compare...

Be free, use Linux! ma meglio se openSUSE...

Ritratto di anubis
anubis
(Guru)
Offline
Guru
Iscritto: 07/04/2007
Messaggi: 3656

http://mirror.switch.ch/ftp/mirror/opensuse/distribution/10.3/repo/oss/suse/i586/xorg-x11-libXext-devel-7.2-65.i586.rpm
http://mirror.switch.ch/ftp/mirror/opensuse/distribution/10.3/repo/oss/suse/i586/xorg-x11-libXext-7.2-65.i586.rpm

OpenSUSE Member,Packman Packager, Education Project Admin, LXDE Project Admin
Powered by http://en.opensuse.org/HP_Pavilion_dv6855el

Ritratto di orion
orion
(Guru)
Offline
Guru
Iscritto: 11/07/2006
Messaggi: 2919

Non so se convenga prendere quelli dentro i586 o quelli dentro x86_64, dato che ci sono proprio i due pacchetti specifici 32 bit per x86_64.

openSUSE 12.1 on Acer Aspire 1810tz - LXDE ultima versione dal repo x11:/lxde

Ritratto di Utino
Utino
(Monster)
Offline
Monster
Iscritto: 14/10/2006
Messaggi: 212

uffa, installati ma non cambia nulla...

Ho anche verificato in /usr/lib e /usr/lib e le librerie ci sono...
scusa ma... hai altre idee?

ah, per ora ho installato i 32 bit con architettura X86_64, devo rimuoverli e provare gli i586?

rettifico, ho provato a disinstallarle ma mi dice che devo eliminare mille altri pacchetti... e se le tolgo senza togliere gli altri pacchetti e installo le i586, spacco tutto?

Be free, use Linux! ma meglio se openSUSE...