Problema installazione amsn svn

5 risposte [Ultimo messaggio]
Ritratto di giovalesto
giovalesto
(Newbie)
Offline
Newbie
Iscritto: 20/08/2007
Messaggi: 3

Ciao a tutti sn nuovo di opensuse ma già mi sta piacnedo Smile
c'è un problema, nn riesco ad installare amsn svn seguendo la guida di questo sito:
giovalesto@linux-1kum:~/programmi/msn> ./configure && make<br />checking for prefix by checking for wish... /usr/bin/wish<br />checking for gcc... no<br />checking for cc... no<br />checking for cc... no<br />checking for cl... no<br />configure: error: no acceptable C compiler found in $PATH<br />See `config.log' for more details.<br />

Ritratto di auris
auris
(Guru)
Offline
Guru
Iscritto: 10/09/2004
Messaggi: 4923

Installa gcc tramite YAST.

Se sei stanco di virus e schermate blu passa a Linux

Ritratto di giovalesto
giovalesto
(Newbie)
Offline
Newbie
Iscritto: 20/08/2007
Messaggi: 3

giovalesto@linux-1kum:~/programmi/msn&gt; ./configure &amp;&amp; make<br />checking for prefix by checking for wish... /usr/bin/wish<br />checking for gcc... gcc<br />checking for C compiler default output file name... a.out<br />checking whether the C compiler works... yes<br />checking whether we are cross compiling... no<br />checking for suffix of executables... <br />checking for suffix of object files... o<br />checking whether we are using the GNU C compiler... yes<br />checking whether gcc accepts -g... yes<br />checking for gcc option to accept ANSI C... none needed<br />checking for g++... g++<br />checking whether we are using the GNU C++ compiler... yes<br />checking whether g++ accepts -g... yes<br />checking tcl build dir... ./configure: line 2841: locate: command not found<br />configure: error: Unable to find Tcl directory or Tcl package is not tcl-dev<br />giovalesto@linux-1kum:~/programmi/msn&gt;

Ritratto di giovalesto
giovalesto
(Newbie)
Offline
Newbie
Iscritto: 20/08/2007
Messaggi: 3

giovalesto@linux-1kum:~/programmi/msn&gt; ./configure &amp;&amp; make<br />checking for prefix by checking for wish... /usr/bin/wish<br />checking for gcc... gcc<br />checking for C compiler default output file name... a.out<br />checking whether the C compiler works... yes<br />checking whether we are cross compiling... no<br />checking for suffix of executables... <br />checking for suffix of object files... o<br />checking whether we are using the GNU C compiler... yes<br />checking whether gcc accepts -g... yes<br />checking for gcc option to accept ANSI C... none needed<br />checking for g++... g++<br />checking whether we are using the GNU C++ compiler... yes<br />checking whether g++ accepts -g... yes<br />checking tcl build dir... ./configure: line 2841: locate: command not found<br />using tcl library in /usr/lib<br />checking tk build dir... using tk library in /usr/lib<br />checking for main in -lstdc++... yes<br />checking how to run the C preprocessor... gcc -E<br />checking for X... no<br />&quot;Could not find X11 devel package<br />checking for egrep... grep -E<br />checking for ANSI C header files... yes<br />checking for sys/types.h... yes<br />checking for sys/stat.h... yes<br />checking for stdlib.h... yes<br />checking for string.h... yes<br />checking for memory.h... yes<br />checking for strings.h... yes<br />checking for inttypes.h... yes<br />checking for stdint.h... yes<br />checking for unistd.h... yes<br />checking for png_read_info in -lpng... yes<br />checking png.h usability... yes<br />checking png.h presence... yes<br />checking for png.h... yes<br />checking for jpeg_CreateDecompress in -ljpeg... yes<br />checking jpeglib.h usability... yes<br />checking jpeglib.h presence... yes<br />checking for jpeglib.h... yes<br />checking jerror.h usability... yes<br />checking jerror.h presence... yes<br />checking for jerror.h... yes<br />checking for ftello... yes<br />checking for fseeko... yes<br />checking for getpt... yes<br />checking for strcasestr... yes<br />checking for memmem... yes<br />checking for dlopen... no<br />checking for pthread_create in -lpthread... yes<br />checking if mmx should be used... yes<br />configure: creating ./config.status<br />config.status: creating Makefile<br />config.status: creating ./utils/linux/capture/config.h<br /><br />compile time options summary<br />============================<br /><br />    X11          : no<br />    Tcl          : 8.4<br />    TK           : 8.4<br />    DEBUG        : no<br />    STATIC       : no<br /><br />  CXX     utils/TkCximage/src/TkCximage.cpp.o<br />In file included from utils/TkCximage/src/TkCximage.h:21,<br />                 from utils/TkCximage/src/TkCximage.cpp:11:<br />/usr/include/tk.h:83:23: error: X11/Xlib.h: No such file or directory<br />/usr/include/tk.h:559: error: typedef ‘Window’ is initialized (use __typeof__ instead)<br />/usr/include/tk.h:559: error: ‘Tk_ClassCreateProc’ was not declared in this scope<br />/usr/include/tk.h:562: error: ‘XEvent’ has not been declared<br />/usr/include/tk.h:571: error: expected ‘;’ before ‘*’ token<br />/usr/include/tk.h:665: error: ‘Bool’ does not name a type<br />/usr/include/tk.h:666: error: expected ‘;’ before ‘*’ token<br />/usr/include/tk.h:667: error: ‘Window’ does not name a type<br />/usr/include/tk.h:668: error: ‘Window’ does not name a type<br />/usr/include/tk.h:669: error: ‘Window’ does not name a type<br />/usr/include/tk.h:670: error: ‘Time’ does not name a type<br />/usr/include/tk.h:675: error: ‘Bool’ does not name a type<br />/usr/include/tk.h:681: error: ‘Bool’ does not name a type<br />/usr/include/tk.h:682: error: expected ‘;’ before ‘*’ token<br />/usr/include/tk.h:683: error: ‘Window’ does not name a type<br />/usr/include/tk.h:758: error: expected ‘;’ before ‘*’ token<br />/usr/include/tk.h:761: error: expected ‘;’ before ‘*’ token<br />/usr/include/tk.h:763: error: ‘Window’ does not name a type<br />/usr/include/tk.h:772: error: ‘XWindowChanges’ does not name a type<br />/usr/include/tk.h:774: error: ‘XSetWindowAttributes’ does not name a type<br />/usr/include/tk.h:908: error: ‘XPoint’ has not been declared<br />/usr/include/tk.h:1009: error: ‘Display’ has not been declared<br />/usr/include/tk.h:1011: error: ‘Display’ has not been declared<br />/usr/include/tk.h:1011: error: ‘Drawable’ has not been declared<br />/usr/include/tk.h:1108: error: expected ‘;’ before ‘*’ token<br />/usr/include/tk.h:1172: error: ‘GC’ does not name a type<br />/usr/include/tk.h:1184: error: expected ‘;’ before ‘*’ token<br />/usr/include/tk.h:1185: error: expected ‘;’ before ‘*’ token<br />/usr/include/tk.h:1186: error: expected ‘;’ before ‘*’ token<br />/usr/include/tk.h:1187: error: ‘Pixmap’ does not name a type<br />/usr/include/tk.h:1188: error: ‘Pixmap’ does not name a type<br />/usr/include/tk.h:1189: error: ‘Pixmap’ does not name a type<br />/usr/include/tk.h:1213: error: ‘Display’ has not been declared<br />/usr/include/tk.h:1213: error: ‘Drawable’ has not been declared<br />/usr/include/tk.h:1216: error: ‘Display’ has not been declared<br />/usr/include/tk.h:1421: error: ‘Drawable’ has not been declared<br />/usr/include/tk.h:1538: error: ‘XErrorEvent’ has not been declared<br />/usr/include/tk.h:1540: error: ‘XEvent’ has not been declared<br />/usr/include/tk.h:1542: error: ‘XEvent’ has not been declared<br />/usr/include/tk.h:1544: error: ‘XEvent’ has not been declared<br />/usr/include/tk.h:1549: error: ‘XEvent’ has not been declared<br />/usr/include/tkDecls.h:37: error: expected constructor, destructor, or type conversion before ‘*’ token<br />/usr/include/tkDecls.h:39: error: ‘GC’ does not name a type<br />/usr/include/tkDecls.h:42: error: ‘Drawable’ has not been declared<br />/usr/include/tkDecls.h:47: error: ‘Drawable’ has not been declared<br />/usr/include/tkDecls.h:56: error: ‘XEvent’ has not been declared<br />/usr/include/tkDecls.h:76: error: ‘Pixmap’ has not been declared<br />/usr/include/tkDecls.h:80: error: ‘XColor’ has not been declared<br />/usr/include/tkDecls.h:90: error: ‘Pixmap’ has not been declared<br />/usr/include/tkDecls.h:95: error: ‘GC’ has not been declared<br />/usr/include/tkDecls.h:114: error: ‘XSetWindowAttributes’ has not been declared<br />/usr/include/tkDecls.h:122: error: ‘Atom’ has not been declared<br />/usr/include/tkDecls.h:125: error: ‘Atom’ has not been declared<br />/usr/include/tkDecls.h:125: error: ‘Atom’ has not been declared<br />/usr/include/tkDecls.h:147: error: ‘XWindowChanges’ has not been declared<br />/usr/include/tkDecls.h:167: error: ‘Display’ was not declared in this scope<br />/usr/include/tkDecls.h:167: error: ‘display’ was not declared in this scope<br />/usr/include/tkDecls.h:167: error: expected primary-expression before ‘int’<br />/usr/include/tkDecls.h:167: error: expected primary-expression before ‘int’<br />/usr/include/tkDecls.h:167: error: expected primary-expression before ‘int’<br />/usr/include/tkDecls.h:167: error: expected primary-expression before ‘*’ token<br />/usr/include/tkDecls.h:167: error: ‘errorProc’ was not declared in this scope<br />/usr/include/tkDecls.h:167: error: expected primary-expression before ‘clientData’<br />/usr/include/tkDecls.h:167: error: initializer expression list treated as compound expression<br />/usr/include/tkDecls.h:187: error: ‘Atom’ has not been declared<br />/usr/include/tkDecls.h:187: error: ‘Atom’ has not been declared<br />/usr/include/tkDecls.h:187: error: ‘Atom’ has not been declared<br />/usr/include/tkDecls.h:232: error: ‘Atom’ has not been declared<br />/usr/include/tkDecls.h:232: error: ‘Atom’ has not been declared<br />/usr/include/tkDecls.h:242: error: ‘Drawable’ has not been declared<br />/usr/include/tkDecls.h:242: error: ‘XPoint’ has not been declared<br />/usr/include/tkDecls.h:247: error: ‘Drawable’ has not been declared<br />/usr/include/tkDecls.h:252: error: variable or field ‘Tk_DrawChars’ declared void<br />/usr/include/tkDecls.h:252: error: ‘Display’ was not declared in this scope<br />/usr/include/tkDecls.h:252: error: ‘display’ was not declared in this scope<br />/usr/include/tkDecls.h:252: error: ‘Drawable’ was not declared in this scope<br />/usr/include/tkDecls.h:252: error: ‘GC’ was not declared in this scope<br />/usr/include/tkDecls.h:252: error: expected primary-expression before ‘tkfont’<br />/usr/include/tkDecls.h:252: error: expected primary-expression before ‘const’<br />/usr/include/tkDecls.h:252: error: expected primary-expression before ‘int’<br />/usr/include/tkDecls.h:252: error: expected primary-expression before ‘int’<br />/usr/include/tkDecls.h:252: error: expected primary-expression before ‘int’<br />/usr/include/tkDecls.h:252: error: initializer expression list treated as compound expression<br />/usr/include/tkDecls.h:257: error: ‘GC’ has not been declared<br />/usr/include/tkDecls.h:257: error: ‘Drawable’ has not been declared<br />/usr/include/tkDecls.h:260: error: variable or field ‘Tk_DrawTextLayout’ declared void<br />/usr/include/tkDecls.h:260: error: ‘Display’ was not declared in this scope<br />/usr/include/tkDecls.h:260: error: ‘display’ was not declared in this scope<br />/usr/include/tkDecls.h:260: error: ‘Drawable’ was not declared in this scope<br />/usr/include/tkDecls.h:260: error: ‘GC’ was not declared in this scope<br />/usr/include/tkDecls.h:260: error: expected primary-expression before ‘layout’<br />/usr/include/tkDecls.h:260: error: expected primary-expression before ‘int’<br />/usr/include/tkDecls.h:260: error: expected primary-expression before ‘int’<br />/usr/include/tkDecls.h:260: error: expected primary-expression before ‘int’<br />/usr/include/tkDecls.h:260: error: expected primary-expression before ‘int’<br />/usr/include/tkDecls.h:260: error: initializer expression list treated as compound expression<br />/usr/include/tkDecls.h:265: error: ‘Drawable’ has not been declared<br />/usr/include/tkDecls.h:265: error: ‘XPoint’ has not been declared<br />/usr/include/tkDecls.h:270: error: ‘Drawable’ has not been declared<br />/usr/include/tkDecls.h:278: error: ‘Font’ does not name a type<br />/usr/include/tkDecls.h:282: error: variable or field ‘Tk_FreeBitmap’ declared void<br />/usr/include/tkDecls.h:282: error: ‘Display’ was not declared in this scope<br />/usr/include/tkDecls.h:282: error: ‘display’ was not declared in this scope<br />/usr/include/tkDecls.h:282: error: ‘Pixmap’ was not declared in this scope<br />/usr/include/tkDecls.h:282: error: initializer expression list treated as compound expression<br />/usr/include/tkDecls.h:285: error: variable or field ‘Tk_FreeColor’ declared void<br />/usr/include/tkDecls.h:285: error: ‘XColor’ was not declared in this scope<br />/usr/include/tkDecls.h:285: error: ‘colorPtr’ was not declared in this scope<br />/usr/include/tkDecls.h:287: error: variable or field ‘Tk_FreeColormap’ declared void<br />/usr/include/tkDecls.h:287: error: ‘Display’ was not declared in this scope<br />/usr/include/tkDecls.h:287: error: ‘display’ was not declared in this scope<br />/usr/include/tkDecls.h:287: error: ‘Colormap’ was not declared in this scope<br />/usr/include/tkDecls.h:287: error: initializer expression list treated as compound expression<br />/usr/include/tkDecls.h:290: error: variable or field ‘Tk_FreeCursor’ declared void<br />/usr/include/tkDecls.h:290: error: ‘Display’ was not declared in this scope<br />/usr/include/tkDecls.h:290: error: ‘display’ was not declared in this scope<br />/usr/include/tkDecls.h:290: error: expected primary-expression before ‘cursor’<br />/usr/include/tkDecls.h:290: error: initializer expression list treated as compound expression<br />/usr/include/tkDecls.h:295: error: variable or field ‘Tk_FreeGC’ declared void<br />/usr/include/tkDecls.h:295: error: ‘Display’ was not declared in this scope<br />/usr/include/tkDecls.h:295: error: ‘display’ was not declared in this scope<br />/usr/include/tkDecls.h:295: error: ‘GC’ was not declared in this scope<br />/usr/include/tkDecls.h:295: error: initializer expression list treated as compound expression<br />/usr/include/tkDecls.h:299: error: ‘Display’ has not been declared<br />/usr/include/tkDecls.h:303: error: variable or field ‘Tk_FreePixmap’ declared void<br />/usr/include/tkDecls.h:303: error: ‘Display’ was not declared in this scope<br />/usr/include/tkDecls.h:303: error: ‘display’ was not declared in this scope<br />/usr/include/tkDecls.h:303: error: ‘Pixmap’ was not declared in this scope<br />/usr/include/tkDecls.h:303: error: initializer expression list treated as compound expression<br />/usr/include/tkDecls.h:309: error: variable or field ‘Tk_FreeXId’ declared void<br />/usr/include/tkDecls.h:309: error: ‘Display’ was not declared in this scope<br />/usr/include/tkDecls.h:309: error: ‘display’ was not declared in this scope<br />/usr/include/tkDecls.h:309: error: ‘XID’ was not declared in this scope<br />/usr/include/tkDecls.h:309: error: initializer expression list treated as compound expression<br />/usr/include/tkDecls.h:311: error: ‘GC’ does not name a type<br />/usr/include/tkDecls.h:327: error: ‘Atom’ has not been declared<br />/usr/include/tkDecls.h:334: error: ‘Pixmap’ does not name a type<br />/usr/include/tkDecls.h:337: error: ‘Pixmap’ does not name a type<br />/usr/include/tkDecls.h:344: error: expected constructor, destructor, or type conversion before ‘*’ token<br />/usr/include/tkDecls.h:347: error: expected constructor, destructor, or type conversion before ‘*’ token<br />/usr/include/tkDecls.h:350: error: ‘Colormap’ does not name a type<br />/usr/include/tkDecls.h:371: error: ‘GC’ does not name a type<br />/usr/include/tkDecls.h:401: error: ‘Pixmap’ does not name a type<br />/usr/include/tkDecls.h:418: error: ‘Atom’ has not been declared<br />/usr/include/tkDecls.h:418: error: ‘Atom’ has not been declared<br />/usr/include/tkDecls.h:424: error: expected constructor, destructor, or type conversion before ‘*’ token<br />/usr/include/tkDecls.h:435: error: variable or field ‘Tk_HandleEvent’ declared void<br />/usr/include/tkDecls.h:435: error: ‘XEvent’ was not declared in this scope<br />/usr/include/tkDecls.h:435: error: ‘eventPtr’ was not declared in this scope<br />/usr/include/tkDecls.h:437: error: ‘Display’ was not declared in this scope<br />/usr/include/tkDecls.h:437: error: ‘display’ was not declared in this scope<br />/usr/include/tkDecls.h:437: error: ‘Window’ was not declared in this scope<br />/usr/include/tkDecls.h:437: error: initializer expression list treated as compound expression<br />/usr/include/tkDecls.h:446: error: ‘Atom’ does not name a type<br />/usr/include/tkDecls.h:484: error: ‘Display’ was not declared in this scope<br />/usr/include/tkDecls.h:484: error: ‘display’ was not declared in this scope<br />/usr/include/tkDecls.h:484: error: ‘Pixmap’ was not declared in this scope<br />/usr/include/tkDecls.h:484: error: initializer expression list treated as compound expression<br />/usr/include/tkDecls.h:489: error: ‘XColor’ was not declared in this scope<br />/usr/include/tkDecls.h:489: error: ‘colorPtr’ was not declared in this scope<br />/usr/include/tkDecls.h:491: error: ‘Display’ was not declared in this scope<br />/usr/include/tkDecls.h:491: error: ‘display’ was not declared in this scope<br />/usr/include/tkDecls.h:491: error: expected primary-expression before ‘cursor’<br />/usr/include/tkDecls.h:491: error: initializer expression list treated as compound expression<br />/usr/include/tkDecls.h:509: error: ‘Atom’ has not been declared<br />/usr/include/tkDecls.h:549: error: variable or field ‘Tk_PreserveColormap’ declared void<br />/usr/include/tkDecls.h:549: error: ‘Display’ was not declared in this scope<br />/usr/include/tkDecls.h:549: error: ‘display’ was not declared in this scope<br />/usr/include/tkDecls.h:549: error: ‘Colormap’ was not declared in this scope<br />/usr/include/tkDecls.h:549: error: initializer expression list treated as compound expression<br />/usr/include/tkDecls.h:552: error: variable or field ‘Tk_QueueWindowEvent’ declared void<br />/usr/include/tkDecls.h:552: error: ‘XEvent’ was not declared in this scope<br />/usr/include/tkDecls.h:552: error: ‘eventPtr’ was not declared in this scope<br />/usr/include/tkDecls.h:552: error: expected primary-expression before ‘position’<br />/usr/include/tkDecls.h:552: error: initializer expression list treated as compound expression<br />/usr/include/tkDecls.h:555: error: ‘Drawable’ has not been declared<br />/usr/include/tkDecls.h:591: error: ‘Pixmap’ has not been declared<br />/usr/include/tkDecls.h:600: error: ‘Pixmap’ has not been declared<br />/usr/include/tkDecls.h:603: error: ‘Colormap’ has not been declared<br />/usr/include/tkDecls.h:606: error: ‘Visual’ has not been declared<br />/usr/include/tkDecls.h:606: error: ‘Colormap’ has not been declared<br />/usr/include/tkDecls.h:610: error: variable or field ‘Tk_SizeOfBitmap’ declared void<br />/usr/include/tkDecls.h:610: error: ‘Display’ was not declared in this scope<br />/usr/include/tkDecls.h:610: error: ‘display’ was not declared in this scope<br />/usr/include/tkDecls.h:610: error: ‘Pixmap’ was not declared in this scope<br />/usr/include/tkDecls.h:610: error: expected primary-expression before ‘int’<br />/usr/include/tkDecls.h:610: error: expected primary-expression before ‘int’<br />/usr/include/tkDecls.h:610: error: initializer expression list treated as compound expression<br />/usr/include/tkDecls.h:627: error: variable or field ‘Tk_UnderlineChars’ declared void<br />/usr/include/tkDecls.h:627: error: ‘Display’ was not declared in this scope<br />/usr/include/tkDecls.h:627: error: ‘display’ was not declared in this scope<br />/usr/include/tkDecls.h:627: error: ‘Drawable’ was not declared in this scope<br />/usr/include/tkDecls.h:627: error: ‘GC’ was not declared in this scope<br />/usr/include/tkDecls.h:627: error: expected primary-expression before ‘tkfont’<br />/usr/include/tkDecls.h:627: error: expected primary-expression before ‘const’<br />/usr/include/tkDecls.h:627: error: expected primary-expression before ‘int’<br />/usr/include/tkDecls.h:627: error: expected primary-expression before ‘int’<br />/usr/include/tkDecls.h:627: error: expected primary-expression before ‘int’<br />/usr/include/tkDecls.h:627: error: expected primary-expression before ‘int’<br />/usr/include/tkDecls.h:627: error: initializer expression list treated as compound expression<br />/usr/include/tkDecls.h:632: error: variable or field ‘Tk_UnderlineTextLayout’ declared void<br />/usr/include/tkDecls.h:632: error: ‘Display’ was not declared in this scope<br />/usr/include/tkDecls.h:632: error: ‘display’ was not declared in this scope<br />/usr/include/tkDecls.h:632: error: ‘Drawable’ was not declared in this scope<br />/usr/include/tkDecls.h:632: error: ‘GC’ was not declared in this scope<br />/usr/include/tkDecls.h:632: error: expected primary-expression before ‘layout’<br />/usr/include/tkDecls.h:632: error: expected primary-expression before ‘int’<br />/usr/include/tkDecls.h:632: error: expected primary-expression before ‘int’<br />/usr/include/tkDecls.h:632: error: expected primary-expression before ‘int’<br />/usr/include/tkDecls.h:632: error: initializer expression list treated as compound expression<br />/usr/include/tkDecls.h:649: error: ‘Pixmap’ does not name a type<br />/usr/include/tkDecls.h:657: error: expected constructor, destructor, or type conversion before ‘*’ token<br />/usr/include/tkDecls.h:702: error: ‘Pixmap’ does not name a type<br />/usr/include/tkDecls.h:705: error: expected constructor, destructor, or type conversion before ‘*’ token<br />/usr/include/tkDecls.h:772: error: variable or field ‘Tk_DeleteOutline’ declared void<br />/usr/include/tkDecls.h:772: error: ‘Display’ was not declared in this scope<br />/usr/include/tkDecls.h:772: error: ‘display’ was not declared in this scope<br />/usr/include/tkDecls.h:772: error: expected primary-expression before ‘*’ token<br />/usr/include/tkDecls.h:772: error: ‘outline’ was not declared in this scope<br />/usr/include/tkDecls.h:772: error: initializer expression list treated as compound expression<br />/usr/include/tkDecls.h:775: error: ‘XGCValues’ was not declared in this scope<br />/usr/include/tkDecls.h:775: error: ‘gcValues’ was not declared in this scope<br />/usr/include/tkDecls.h:775: error: expected primary-expression before ‘canvas’<br />/usr/include/tkDecls.h:775: error: expected primary-expression before ‘*’ token<br />/usr/include/tkDecls.h:775: error: ‘item’ was not declared in this scope<br />/usr/include/tkDecls.h:775: error: expected primary-expression before ‘*’ token<br />/usr/include/tkDecls.h:775: error: ‘outline’ was not declared in this scope<br />/usr/include/tkDecls.h:775: error: initializer expression list treated as compound expression<br />/usr/include/tkDecls.h:788: error: ‘GC’ has not been declared<br />/usr/include/tkDecls.h:795: error: ‘GC’ has not been declared<br />/usr/include/tkDecls.h:801: error: ‘Pixmap’ has not been declared<br />/usr/include/tkDecls.h:806: error: ‘XColor’ has not been declared<br />/usr/include/tkDecls.h:821: error: ‘Pixmap’ has not been declared<br />/usr/include/tkDecls.h:866: error: ‘Display’ was not declared in this scope<br />/usr/include/tkDecls.h:866: error: ‘display’ was not declared in this scope<br />/usr/include/tkDecls.h:866: error: expected primary-expression before ‘int’<br />/usr/include/tkDecls.h:866: error: initializer expression list treated as compound expression<br />/usr/include/tkDecls.h:915: error: ‘Drawable’ has not been declared<br />/usr/include/tkDecls.h:932: error: expected ‘;’ before ‘*’ token<br />/usr/include/tkDecls.h:933: error: expected identifier before ‘*’ token<br />/usr/include/tkDecls.h:933: error: ‘GC’ declared as function returning a function<br />/usr/include/tkDecls.h:934: error: ‘Drawable’ has not been declared<br />/usr/include/tkDecls.h:935: error: ‘Drawable’ has not been declared<br />/usr/include/tkDecls.h:937: error: ‘XEvent’ has not been declared<br />/usr/include/tkDecls.h:942: error: ‘Pixmap’ has not been declared<br />/usr/include/tkDecls.h:943: error: ‘XColor’ has not been declared<br />/usr/include/tkDecls.h:946: error: ‘Pixmap’ has not been declared<br />/usr/include/tkDecls.h:948: error: ‘GC’ is not a type<br />/usr/include/tkDecls.h:953: error: ‘XSetWindowAttributes’ has not been declared<br />/usr/include/tkDecls.h:955: error: ‘Atom’ has not been declared<br />/usr/include/tkDecls.h:956: error: ‘Atom’ has not been declared<br />/usr/include/tkDecls.h:956: error: ‘Atom’ has not been declared<br />/usr/include/tkDecls.h:961: error: ‘XWindowChanges’ has not been declared<br />/usr/include/tkDecls.h:966: error: ‘Display’ has not been declared<br />/usr/include/tkDecls.h:972: error: ‘Atom’ has not been declared<br />/usr/include/tkDecls.h:972: error: ‘Atom’ has not been declared<br />/usr/include/tkDecls.h:972: error: ‘Atom’ has not been declared<br />/usr/include/tkDecls.h:984: error: ‘Atom’ has not been declared<br />/usr/include/tkDecls.h:984: error: ‘Atom’ has not been declared<br />/usr/include/tkDecls.h:988: error: ‘Drawable’ has not been declared<br />/usr/include/tkDecls.h:988: error: ‘XPoint’ has not been declared<br />/usr/include/tkDecls.h:989: error: ‘Drawable’ has not been declared<br />/usr/include/tkDecls.h:990: error: ‘Display’ has not been declared<br />/usr/include/tkDecls.h:990: error: ‘Drawable’ has not been declared<br />/usr/include/tkDecls.h:990: error: ‘GC’ is not a type<br />/usr/include/tkDecls.h:991: error: ‘GC’ is not a type<br />/usr/include/tkDecls.h:991: error: ‘Drawable’ has not been declared<br />/usr/include/tkDecls.h:992: error: ‘Display’ has not been declared<br />/usr/include/tkDecls.h:992: error: ‘Drawable’ has not been declared<br />/usr/include/tkDecls.h:992: error: ‘GC’ is not a type<br />/usr/include/tkDecls.h:993: error: ‘Drawable’ has not been declared<br />/usr/include/tkDecls.h:993: error: ‘XPoint’ has not been declared<br />/usr/include/tkDecls.h:994: error: ‘Drawable’ has not been declared<br />/usr/include/tkDecls.h:996: error: expected identifier before ‘*’ token<br />/usr/include/tkDecls.h:996: error: ‘Font’ declared as function returning a function<br />/usr/include/tkDecls.h:998: error: ‘Display’ has not been declared<br />/usr/include/tkDecls.h:998: error: ‘Pixmap’ has not been declared<br />/usr/include/tkDecls.h:999: error: ‘XColor’ has not been declared<br />/usr/include/tkDecls.h:1000: error: ‘Display’ has not been declared<br />/usr/include/tkDecls.h:1000: error: ‘Colormap’ has not been declared<br />/usr/include/tkDecls.h:1001: error: ‘Display’ has not been declared<br />/usr/include/tkDecls.h:1003: error: ‘Display’ has not been declared<br />/usr/include/tkDecls.h:1003: error: ‘GC’ is not a type<br />/usr/include/tkDecls.h:1005: error: ‘Display’ has not been declared<br />/usr/include/tkDecls.h:1006: error: ‘Display’ has not been declared<br />/usr/include/tkDecls.h:1006: error: ‘Pixmap’ has not been declared<br />/usr/include/tkDecls.h:1008: error: ‘Display’ has not been declared<br />/usr/include/tkDecls.h:1008: error: ‘XID’ has not been declared<br />/usr/include/tkDecls.h:1009: error: expected identifier before ‘*’ token<br />/usr/include/tkDecls.h:1009: error: ‘XColor’ has not been declared<br />/usr/include/tkDecls.h:1009: error: ‘Drawable’ has not been declared<br />/usr/include/tkDecls.h:1009: error: ‘GC’ declared as function returning a function<br />/usr/include/tkDecls.h:1009: error: ‘int TkStubs::GC(int*)’ cannot be overloaded<br />/usr/include/tkDecls.h:933: error: with ‘int TkStubs::GC(int*)<br />/usr/include/tkDecls.h:1014: error: ‘Atom’ has not been declared<br />/usr/include/tkDecls.h:1016: error: expected identifier before ‘*’ token<br />/usr/include/tkDecls.h:1016: error: ‘Pixmap’ declared as function returning a function<br />/usr/include/tkDecls.h:1017: error: expected identifier before ‘*’ token<br />/usr/include/tkDecls.h:1017: error: ‘Pixmap’ declared as function returning a function<br />/usr/include/tkDecls.h:1017: error: ‘int TkStubs::Pixmap(int*)’ cannot be overloaded<br />/usr/include/tkDecls.h:1016: error: with ‘int TkStubs::Pixmap(int*)<br />/usr/include/tkDecls.h:1019: error: expected ‘;’ before ‘*’ token<br />/usr/include/tkDecls.h:1020: error: expected ‘;’ before ‘*’ token<br />/usr/include/tkDecls.h:1021: error: expected identifier before ‘*’ token<br />/usr/include/tkDecls.h:1021: error: ‘Colormap’ declared as function returning a function<br />/usr/include/tkDecls.h:1027: error: expected identifier before ‘*’ token<br />/usr/include/tkDecls.h:1027: error: ‘XGCValues’ has not been declared<br />/usr/include/tkDecls.h:1027: error: ‘GC’ declared as function returning a function<br />/usr/include/tkDecls.h:1027: error: ‘int TkStubs::GC(int*)’ cannot be overloaded<br />/usr/include/tkDecls.h:933: error: with ‘int TkStubs::GC(int*)<br />/usr/include/tkDecls.h:1036: error: expected identifier before ‘*’ token<br />/usr/include/tkDecls.h:1036: error: ‘Display’ has not been declared<br />/usr/include/tkDecls.h:1036: error: ‘Drawable’ has not been declared<br />/usr/include/tkDecls.h:1036: error: ‘Pixmap’ declared as function returning a function<br />/usr/include/tkDecls.h:1036: error: ‘int TkStubs::Pixmap(int*)’ cannot be overloaded<br />/usr/include/tkDecls.h:1016: error: with ‘int TkStubs::Pixmap(int*)<br />/usr/include/tkDecls.h:1041: error: ‘Atom’ has not been declared<br />/usr/include/tkDecls.h:1041: error: ‘Atom’ has not been declared<br />/usr/include/tkDecls.h:1043: error: expected ‘;’ before ‘*’ token<br />/usr/include/tkDecls.h:1046: error: ‘XEvent’ has not been declared<br />/usr/include/tkDecls.h:1047: error: ‘Display’ has not been declared<br />/usr/include/tkDecls.h:1047: error: ‘Window’ has not been declared<br />/usr/include/tkDecls.h:1050: error: expected identifier before ‘*’ token<br />/usr/include/tkDecls.h:1050: error: ‘Atom’ declared as function returning a function<br />/usr/include/tkDecls.h:1063: error: expected ‘;’ before ‘(’ token<br />/usr/include/tkDecls.h:1065: error: expected ‘;’ before ‘(’ token<br />/usr/include/tkDecls.h:1066: error: expected ‘;’ before ‘(’ token<br />/usr/include/tkDecls.h:1073: error: ‘Atom’ is not a type<br />/usr/include/tkDecls.h:1084: error: ‘Display’ has not been declared<br />/usr/include/tkDecls.h:1084: error: ‘Colormap’ is not a type<br />/usr/include/tkDecls.h:1085: error: ‘XEvent’ has not been declared<br />/usr/include/tkDecls.h:1086: error: ‘Drawable’ has not been declared<br />/usr/include/tkDecls.h:1097: error: ‘Pixmap’ is not a type<br />/usr/include/tkDecls.h:1100: error: ‘Pixmap’ is not a type<br />/usr/include/tkDecls.h:1101: error: ‘Colormap’ is not a type<br />/usr/include/tkDecls.h:1102: error: ‘Visual’ has not been declared<br />/usr/include/tkDecls.h:1102: error: ‘Colormap’ is not a type<br />/usr/include/tkDecls.h:1103: error: ‘Display’ has not been declared<br />/usr/include/tkDecls.h:1103: error: ‘Pixmap’ is not a type<br />/usr/include/tkDecls.h:1109: error: ‘Display’ has not been declared<br />/usr/include/tkDecls.h:1109: error: ‘Drawable’ has not been declared<br />/usr/include/tkDecls.h:1109: error: ‘GC’ is not a type<br />/usr/include/tkDecls.h:1110: error: ‘Display’ has not been declared<br />/usr/include/tkDecls.h:1110: error: ‘Drawable’ has not been declared<br />/usr/include/tkDecls.h:1110: error: ‘GC’ is not a type<br />/usr/include/tkDecls.h:1116: error: expected identifier before ‘*’ token<br />/usr/include/tkDecls.h:1116: error: ‘Pixmap’ declared as function returning a function<br />/usr/include/tkDecls.h:1116: error: ‘int TkStubs::Pixmap(int*)’ cannot be overloaded<br />/usr/include/tkDecls.h:1016: error: with ‘int TkStubs::Pixmap(int*)<br />/usr/include/tkDecls.h:1118: error: expected ‘;’ before ‘*’ token<br />/usr/include/tkDecls.h:1132: error: expected identifier before ‘*’ token<br />/usr/include/tkDecls.h:1132: error: ‘Pixmap’ declared as function returning a function<br />/usr/include/tkDecls.h:1132: error: ‘int TkStubs::Pixmap(int*)’ cannot be overloaded<br />/usr/include/tkDecls.h:1016: error: with ‘int TkStubs::Pixmap(int*)<br />/usr/include/tkDecls.h:1133: error: expected ‘;’ before ‘*’ token<br />/usr/include/tkDecls.h:1153: error: ‘Display’ has not been declared<br />/usr/include/tkDecls.h:1154: error: ‘XGCValues’ has not been declared<br />/usr/include/tkDecls.h:1158: error: ‘GC’ is not a type<br />/usr/include/tkDecls.h:1160: error: ‘GC’ is not a type<br />/usr/include/tkDecls.h:1162: error: ‘Pixmap’ is not a type<br />/usr/include/tkDecls.h:1163: error: ‘XColor’ has not been declared<br />/usr/include/tkDecls.h:1167: error: ‘Pixmap’ is not a type<br />/usr/include/tkDecls.h:1179: error: ‘Display’ has not been declared<br />/usr/include/tkDecls.h:1195: error: ‘Drawable’ has not been declared<br />utils/TkCximage/src/TkCximage.h:155: error: ‘Display’ has not been declared<br />utils/TkCximage/src/TkCximage.h:155: error: ‘Drawable’ has not been declared<br />make: *** [utils/TkCximage/src/TkCximage.cpp.o] Error 1<br />giovalesto@linux-1kum:~/programmi/msn&gt;

Ritratto di Alfio
Alfio
(Guru)
Offline
Guru
Iscritto: 30/08/2005
Messaggi: 2678

Usa rpm visto che cè un'alternativa con questa guida utilizzi rpm di raoul ottimo.
http://crismon.altervista.org/amsn.html
Fatta da un'utente del forum con il contributo mio.
Ciao

Ritratto di max73
max73
(Monster)
Offline
Monster
Iscritto: 22/11/2004
Messaggi: 212

Ti mancano i pacchetti devel di X , xorg-x11-devel o qualcosa del genere.